Tungsten, tricarbonyl[(1,2,3,4,5,6-η6)-1,3,5-cycloheptatriene]-

Phase change data

Data compiled by: William E. Acree, Jr., James S. Chickos

Quantity Value Units Method Reference Comment
Δsub92.kJ/molCBrown, Connor, et al., 1977See also Pilcher and Skinner, 1983.

Gas phase ion energetics data

Data compiled by: Sharon G. Lias, Rhoda D. Levin, and Sherif A. Kafafi

Ionization energy determinations

IE (eV) Method Reference Comment
7.32PEFragala, Ciliberto, et al., 1979Vertical value
7.55 ± 0.05PEGower, Kane-Maguire, et al., 1977Vertical value

References

Brown, Connor, et al., 1977
Brown, D.L.S.; Connor, Joseph A.; Demain, Christopher P.; Leung, May L.; Martinho-Simoes, Jose A.; Skinner, Henry A.; Zafarani Moattar, Mohamed T., The thermochemistry of carbonyl complexes of Cr, Mo, Wand Co with arenes, cycloheptatriene, and norbornadiene, Journal of Organometallic Chemistry, 1977, 142, 3, 321-335, https://doi.org/10.1016/S0022-328X(00)88348-5 . [all data]

Pilcher and Skinner, 1983
Pilcher, G.; Skinner, H.A., Thermochemistry of organometallic compounds, 1983, 43-90, https://doi.org/10.1002/9780470771686.ch2 . [all data]