6-Benzene)tungsten tricarbonyl

Gas phase ion energetics data

Data compiled by: Sharon G. Lias, John E. Bartmess, Joel F. Liebman, John L. Holmes, Rhoda D. Levin, and W. Gary Mallard

Ionization energy determinations

IE (eV) Method Reference
6.6PEByers and Hall, 1987

References

Byers and Hall, 1987
Byers, B.P.; Hall, M.B., Comparison of isolobal fragments: Photoelectron spectra and molecular orbital calculations of (arene)tricarbonylchromium, molybdenum, and tungsten complexes, Organometallics, 1987, 6, 2319. [all data]