Molybdenum, tricarbonylchloro(η5-2,4-cyclopentadien-1-yl)-

Reaction thermochemistry data

Data compiled by: José A. Martinho Simões

Individual Reactions

C8H6MoO3 (solution) + Carbon Tetrachloride (solution) = Molybdenum, tricarbonylchloro(η5-2,4-cyclopentadien-1-yl)- (solution) + Trichloromethane (solution)

By formula: C8H6MoO3 (solution) + CCl4 (solution) = C8H5ClMoO3 (solution) + CHCl3 (solution)

Quantity Value Units Method Reference Comment
Δr-133.1 ± 3.8kJ/molRSCNolan, López de la Vega, et al., 1986solvent: Tetrahydrofuran; The enthalpy of solution of Mo(Cp)(CO)3(H)(cr) was measured as 8.8 ± 0.4 kJ/mol Nolan, López de la Vega, et al., 1986, 2. Reaction temperature: 323 K

References

Nolan, López de la Vega, et al., 1986
Nolan, S.P.; López de la Vega, R.; Hoff, C.D., J. Organometal. Chem., 1986, 315, 187. [all data]

Nolan, López de la Vega, et al., 1986, 2
Nolan, S.P.; López de la Vega, R.; Hoff, C.D., Organometallics, 1986, 5, 2529. [all data]