Europium dicarbide

Gas phase ion energetics data

Data compiled by: Sharon G. Lias, Rhoda D. Levin, and Sherif A. Kafafi

Ionization energy determinations

IE (eV) Method Reference
6.6 ± 0.7EIBalducci, De Maria, et al., 1972

References

Balducci, De Maria, et al., 1972
Balducci, G.; De Maria, G.; Guido, M., Mass spectrometric determination of the dissociation energy of EuC2(g), J. Chem. Phys., 1972, 56, 1431. [all data]