Molybdenum,tricarbonyl[(1,2,3,4,5,6-η)-1,3,5-cycloheptatriene]-

Phase change data

Data compiled by: William E. Acree, Jr., James S. Chickos

Quantity Value Units Method Reference Comment
Δsub88.0 ± 4.0kJ/molN/APilcher and Skinner, 1983See also Brown, Connor, et al., 1977.

Gas phase ion energetics data

Data compiled as indicated in comments:
LLK - Sharon G. Lias, Rhoda D. Levin, and Sherif A. Kafafi

Ionization energy determinations

IE (eV) Method Reference Comment
7.44PEFragala, Ciliberto, et al., 1979Vertical value; LLK
7.46 ± 0.05PEGower, Kane-Maguire, et al., 1977Vertical value; LLK

References

Pilcher and Skinner, 1983
Pilcher, G.; Skinner, H.A., Thermochemistry of organometallic compounds, 1983, 43-90, https://doi.org/10.1002/9780470771686.ch2 . [all data]

Brown, Connor, et al., 1977
Brown, D.L.S.; Connor, Joseph A.; Demain, Christopher P.; Leung, May L.; Martinho-Simoes, Jose A.; Skinner, Henry A.; Zafarani Moattar, Mohamed T., The thermochemistry of carbonyl complexes of Cr, Mo, Wand Co with arenes, cycloheptatriene, and norbornadiene, Journal of Organometallic Chemistry, 1977, 142, 3, 321-335, https://doi.org/10.1016/S0022-328X(00)88348-5 . [all data]

Fragala, Ciliberto, et al., 1979
Fragala, I.; Ciliberto, E.; Granozzi, G.; Deganello, G., He-I and He-II excited photoelectron spectra of cycloheptatrienetricarbonyl complexes of group VIA metals, J. Organomet. Chem., 1979, 182, 511. [all data]

Gower, Kane-Maguire, et al., 1977
Gower, M.; Kane-Maguire, L.A.P.; Maier, J.P.; Sweigart, D.A., Ultraviolet photoelectron spectra of cyclohepta-1,3,5-triene and mesitylene tricarbonyl complexes of the group 6A metals, J. Chem. Soc. Dalton Trans., 1977, 316. [all data]