Rhenate(1-), tricarbonyl(η3-2-propenyl)-

Reaction thermochemistry data

Data compiled by: John E. Bartmess

Individual Reactions

C6H5O3Re + Bromine = C6H5BrO3Re-

By formula: C6H5O3Re + Br = C6H5BrO3Re-

Quantity Value Units Method Reference Comment
Δr>70.60kcal/molIMRBJones, McDonald, et al., 1989gas phase

C6H5O3Re + Iodine atom = C6H5IO3Re-

By formula: C6H5O3Re + I = C6H5IO3Re-

Quantity Value Units Method Reference Comment
Δr>57.20kcal/molIMRBJones, McDonald, et al., 1989gas phase

C6H5O3Re + Chlorine atom = C6H5ClO3Re-

By formula: C6H5O3Re + Cl = C6H5ClO3Re-

Quantity Value Units Method Reference Comment
Δr>82.80kcal/molIMRBJones, McDonald, et al., 1989gas phase

References

Jones, McDonald, et al., 1989
Jones, M.T.; McDonald, R.N.; Schell, P.L.; Ali, M.H., Kinetics and Mechanism of Halogen Atom Transfer Reactions between Haloalkanes and Several 17-Electron Transition Metal Complex Negative Ions in the Gas Phase, J. Am. Chem. Soc., 1989, 111, 16, 5983, https://doi.org/10.1021/ja00198a001 . [all data]