Chromium,[(1,2,3,4,5,6-η)-benzenemethanol]tricarbonyl-

Gas phase ion energetics data

Data compiled by: Sharon G. Lias, Rhoda D. Levin, and Sherif A. Kafafi

Ionization energy determinations

IE (eV) Method Reference
6.9 ± 0.1EIGilbert, Leach, et al., 1973

Appearance energy determinations

Ion AE (eV) Other Products MethodReferenceComment
C7H8OCr+10.4 ± 0.13COEIGilbert, Leach, et al., 1973
C7H8O+9.4 ± 0.1?EIGilbert, Leach, et al., 1973
C8H8O2Cr+8.2 ± 0.12COEIGilbert, Leach, et al., 1973
C9H8O3Cr+7.3 ± 0.1COEIGilbert, Leach, et al., 1973
Cr+14.0 ± 0.1?EIGilbert, Leach, et al., 1973

References

Gilbert, Leach, et al., 1973
Gilbert, J.R.; Leach, W.P.; Miller, J.R., Ionisation appearance potential measurements in arene chromium tricarbonyls, J. Organomet. Chem., 1973, 49, 219. [all data]