Lithium potassium diiodide

Gas phase ion energetics data

Data compiled by: Henry M. Rosenstock, Keith Draxl, Bruce W. Steiner, and John T. Herron

Appearance energy determinations

Ion AE (eV) Other Products MethodReferenceComment
LiKI+9.0 ± 0.3IEIPlatel, 1965

References

Platel, 1965
Platel, G., Mesures des potentials d'apparition des ions obtenus par impact electronique dans la phase vapeur des iodures alcalins et des melanges LiI-MI, J. Chim. Phys., 1965, 62, 1176. [all data]