Iron, dicarbonyl-cyclopentadienyl-benzenethiolato-

Gas phase ion energetics data

Data compiled by: Sharon G. Lias and Joel F. Liebman

Ionization energy determinations

IE (eV) Method Reference Comment
6.8PEAshby, Enemark, et al., 1988
7.12PEAshby, Enemark, et al., 1988Vertical value

References

Ashby, Enemark, et al., 1988
Ashby, M.T.; Enemark, J.H.; Lichtenberger, D.L., Destabilizing d -p orbital interactions and the alkylation reactions of iron(II)-thiolate complexes, Inorg. Chem., 1988, 27, 191. [all data]