(1,2,3,4,4A,8a-h-naphthalene)tricarbonyl chromium

Phase change data

Data compiled by: William E. Acree, Jr., James S. Chickos

Quantity Value Units Method Reference Comment
Δsub25.6 ± 0.7kcal/molCConnor, Martinho-Simoes, et al., 1979

References

Connor, Martinho-Simoes, et al., 1979
Connor, Joseph A.; Martinho-Simoes, Jose A.; Skinner, Henry A.; Zafarani-Moattar, Mohammad T., Thermochemistry of bis-arene- and arenetricarbonyl-chromium compounds containing hexamethylbenzene, 1,3,5-trimethylbenzene and naphthalene., Journal of Organometallic Chemistry, 1979, 179, 3, 331-356, https://doi.org/10.1016/S0022-328X(00)91750-9 . [all data]