Aniline chromium tricarbonyl

Gas phase ion energetics data

Data compiled as indicated in comments:
LLK - Sharon G. Lias, Rhoda D. Levin, and Sherif A. Kafafi
RDSH - Henry M. Rosenstock, Keith Draxl, Bruce W. Steiner, and John T. Herron

Ionization energy determinations

IE (eV) Method Reference Comment
6.5 ± 0.1EIGilbert, Leach, et al., 1973LLK
7.05EIMuller, 1969RDSH

Appearance energy determinations

Ion AE (eV) Other Products MethodReferenceComment
C6H7NCr+10. ± 0.13COEIGilbert, Leach, et al., 1973LLK
C6H7N+8.0 ± 0.1?EIGilbert, Leach, et al., 1973LLK
C7H7NOCr+7.8 ± 0.12COEIGilbert, Leach, et al., 1973LLK
C8H7NO2Cr+6.8 ± 0.1COEIGilbert, Leach, et al., 1973LLK
Cr+13.2 ± 0.1C6H5NH2+3CEIGilbert, Leach, et al., 1973LLK

References

Gilbert, Leach, et al., 1973
Gilbert, J.R.; Leach, W.P.; Miller, J.R., Ionisation appearance potential measurements in arene chromium tricarbonyls, J. Organomet. Chem., 1973, 49, 219. [all data]

Muller, 1969
Muller, J., Ionisierungspotentiale von substituierten Benzolchrom-tricarbonyl-Komplexen, J. Organometal. Chem., 1969, 18, 321. [all data]

Lundquist and Cais, 1962
Lundquist, R.T.; Cais, M., J. Org. Chem., 1962, 27, 1167. [all data]