3-tert-Butyl-4-hydroxyanisole

Normal alkane RI, non-polar column, custom temperature program

Data compiled by: NIST Mass Spectrometry Data Center, William E. Wallace, director

Column type CapillaryCapillary
Active phase HP-5HP-5MS
Column length (m) 50.30.
Carrier gas HeliumHe
Substrate
Column diameter (mm) 0.320.25
Phase thickness (μm) 1.050.25
Program 40 0C (10 min) 5 0C/min -> 200 0C 15 0C/min -> 250 0C (10 min)40C (10min) => 3C/min => 120C => 10C/min => 250C (5min)
I 1496.1497.
ReferenceVentanas, Estevez, et al., 2008Ansorena, Gimeno, et al., 2001
Comment MSDC-RI MSDC-RI

Phase change data

Data compiled by: William E. Acree, Jr., James S. Chickos

Enthalpy of vaporization

ΔvapH (kJ/mol) Temperature (K) Method Reference Comment
54.4418.AStephenson and Malanowski, 1987Based on data from 403. - 463. K.

References

Ventanas, Estevez, et al., 2008
Ventanas, S.; Estevez, M.; Andres, A.I.; Ruiz, J., Analysis of volatile compounds of Iberian dry-cured loins with different intramuscular fat contents using SPME-DED, Meat Sci., 2008, 79, 1, 172-180, https://doi.org/10.1016/j.meatsci.2007.08.011 . [all data]

Ansorena, Gimeno, et al., 2001
Ansorena, D.; Gimeno, O.; Astiasarán, I.; Bello, J., Analysis of volatile compounds by GC-MS of a dry fermented sausage: chorizo de Pamplona, Food Res. Int., 2001, 34, 1, 67-75, https://doi.org/10.1016/S0963-9969(00)00133-2 . [all data]