bis[(1,2,3,4,5,6-η)-1,1'-biphenyl]chromium(1+) iodide

Condensed phase thermochemistry data

Data compiled as indicated in comments:
MS - José A. Martinho Simões
DH - Eugene S. Domalski and Elizabeth D. Hearing

Quantity Value Units Method Reference Comment
Δfsolid36.3 ± 2.2kcal/molReviewMartinho SimõesMS
Quantity Value Units Method Reference Comment
Δcsolid-3113.0 ± 2.0kcal/molCC-SBTel'noi, Rabinovich, et al., 1972Please also see Pedley and Rylance, 1977 and Tel'noi and Rabinovich, 1977.; MS
Quantity Value Units Method Reference Comment
solid,1 bar101.5cal/mol*KN/ANikolaev, Safonov, et al., 1972DH

Constant pressure heat capacity of solid

Cp,solid (cal/mol*K) Temperature (K) Reference Comment
104.5298.15Nikolaev, Safonov, et al., 1972T = 60 to 298.15 K.; DH

References

Martinho Simões
Martinho Simões, J.A., Private communication (see http://webbook.nist.gov/chemistry/om/). [all data]

Tel'noi, Rabinovich, et al., 1972
Tel'noi, V.I.; Rabinovich, I.B.; Gribov, B.G.; Pashinkin, A.S.; Salamatin, B.A.; Chernova, V.I., Russ. J. Phys. Chem., 1972, 46, 465. [all data]

Pedley and Rylance, 1977
Pedley, J.B.; Rylance, J., Computer Analysed Thermochemical Data: Organic and Organometallic Compounds, University of Sussex, Brigton, 1977. [all data]

Tel'noi and Rabinovich, 1977
Tel'noi, V.I.; Rabinovich, I.B., Russ. Chem. Rev., 1977, 46, 689. [all data]

Nikolaev, Safonov, et al., 1972
Nikolaev, P.N.; Safonov, V.A.; Moseeva, E.M.; Rabinovich, I.B., Specific heat and solid-state transitions of bis(arene)chromium halides, Tr. Khim. Khim. Tekhnol., 1972, (2), 54-60. [all data]