Chromium,(η7-cycloheptatrienylium)(η5-2,4-cyclopentadien-1-yl)-

Gas phase ion energetics data

Data compiled as indicated in comments:
LBLHLM - Sharon G. Lias, John E. Bartmess, Joel F. Liebman, John L. Holmes, Rhoda D. Levin, and W. Gary Mallard
LLK - Sharon G. Lias, Rhoda D. Levin, and Sherif A. Kafafi
RDSH - Henry M. Rosenstock, Keith Draxl, Bruce W. Steiner, and John T. Herron

Ionization energy determinations

IE (eV) Method Reference Comment
5.4PEDavies, Gardiner, et al., 1985LBLHLM
6.0 ± 0.1EIMuller and Goser, 1968RDSH
5.61PEDavies, Gardiner, et al., 1985Vertical value; LBLHLM
5.59 ± 0.05PEEvans, Green, et al., 1974Vertical value; LLK

Appearance energy determinations

Ion AE (eV) Other Products MethodReferenceComment
C5H5Cr+10.4 ± 0.6?EIMuller and Goser, 1968RDSH
C10H10Cr+12.2C2H2EIMuller and Goser, 1968RDSH
Cr+12.2 ± 0.3?EIMuller and Goser, 1968RDSH

References

Davies, Gardiner, et al., 1985
Davies, C.E.; Gardiner, I.M.; Green, J.C.; Green, M.L.H.; Hazel, N.J.; Grebenik, P.D.; Mtetwa, V.S.B.; Prout, K., Mono-η-cycloheptatrienyltitanium chemistry: Synthesis, molecular and electronic structures, and reactivity of the complexes [Ti(η-C7H7)L2X] (L = tertiary phosphine, O- or N-donor ligand. X = Cl or alkyl), J. Chem. Soc. Dalton Trans., 1985, 669. [all data]

Muller and Goser, 1968
Muller, J.; Goser, P., Massenspektroskopische Untersuchungen an Ubergangsmetall-π-Komplexen mit funf-, sechs- und siebengliedrigen aromatischen Ringliganden, J. Organometal. Chem., 1968, 12, 163. [all data]

Evans, Green, et al., 1974
Evans, S.; Green, J.C.; Jackson, S.E.; Higginson, B., He(I) photoelectron spectra of some transition-metal sandwich complexes, J. Chem. Soc. Dalton Trans., 1974, 304. [all data]