Bis(η6-methylbenzene) chromium

Gas phase ion energetics data

Data compiled as indicated in comments:
LBLHLM - Sharon G. Lias, John E. Bartmess, Joel F. Liebman, John L. Holmes, Rhoda D. Levin, and W. Gary Mallard
LLK - Sharon G. Lias, Rhoda D. Levin, and Sherif A. Kafafi

Ionization energy determinations

IE (eV) Method Reference Comment
5.31PECabelli, Cowley, et al., 1982Vertical value; LBLHLM
5.2 ± 0.1PEEvans, Green, et al., 1972Vertical value; LLK

References

Cabelli, Cowley, et al., 1982
Cabelli, D.E.; Cowley, A.H.; Lagowski, J.J., The bonding in some bis(arene)chromium compounds as indicated by U. V. photoelectron zpectroscopy, Inorg. Chim. Acta, 1982, 57, 195. [all data]

Evans, Green, et al., 1972
Evans, S.; Green, J.C.; Jackson, S.E., He(I) photoelectron spectra of some π-arene complexes, J. Chem. Soc. Faraday Trans. 2, 1972, 68, 249. [all data]