dichlorobis(η5-cyclopenta-2,4-dien-1-yl)vanadium

Phase change data

Data compiled by: William E. Acree, Jr., James S. Chickos

Quantity Value Units Method Reference Comment
Δsub33.5 ± 1.8kcal/molMEDiogo, Minas da Piedade, et al., 2001

References

Diogo, Minas da Piedade, et al., 2001
Diogo, Hermínio P.; Minas da Piedade, Manuel E.; Gonçalves, Jorge M.; Monte, Manuel J.S.; Ribeiro da Silva, Manuel A.V., Enthalpies of Sublimation of M(η5-C5H5)2Cl2 (M = Ti, Zr, Hf, V, Nb, W) Complexes, Eur. J. Inorg. Chem., 2001, 2001, 1, 257-262, https://doi.org/10.1002/1099-0682(20011)2001:1<257::AID-EJIC257>3.0.CO;2-2 . [all data]