Ferrocene-d10

Condensed phase thermochemistry data

Data compiled by: Eugene S. Domalski and Elizabeth D. Hearing

Quantity Value Units Method Reference Comment
solid,1 bar55.731cal/mol*KN/ASorai and Shiomi, 1984

Constant pressure heat capacity of solid

Cp,solid (cal/mol*K) Temperature (K) Reference Comment
53.045298.15Sorai and Shiomi, 1984T = 13 to 300 K.

References

Sorai and Shiomi, 1984
Sorai, M.; Shiomi, Y., Thermodynamic properties of ferrocene-d10 crystal: comparison with ferrocene-h10, Mol. Cryst. Liq. Cryst., 1984, 107, 271-292. [all data]