Benzene, 1,2,4-trichloro-
- Formula: C6H3Cl3
- Molecular weight: 181.447
- IUPAC Standard InChIKey: PBKONEOXTCPAFI-UHFFFAOYSA-N
- CAS Registry Number: 120-82-1
- Chemical structure:

Gas phase thermochemistry data

Data compiled by: Hussein Y. Afeefy, Joel F. Liebman, and Stephen E. Stein
Quantity | Value | Units | Method | Reference | Comment |
---|---|---|---|---|---|
ΔfH°gas | 4.9 ± 1.6 | kJ/mol | Ccr | Yan, Gu, et al., 1987 | |
ΔfH°gas | -8.05 | kJ/mol | Ccr | Platonov and Simulin, 1985 |

Condensed phase thermochemistry data

Data compiled as indicated in comments:
ALS - Hussein Y. Afeefy, Joel F. Liebman, and Stephen E. Stein
DH - Eugene S. Domalski and Elizabeth D. Hearing
Quantity | Value | Units | Method | Reference | Comment |
---|---|---|---|---|---|
ΔfH°liquid | -50.2 ± 1.5 | kJ/mol | Ccr | Yan, Gu, et al., 1987 | ALS |
Quantity | Value | Units | Method | Reference | Comment |
ΔcH°liquid | -2810.5 ± 1.5 | kJ/mol | Ccr | Yan, Gu, et al., 1987 | ALS |
ΔcH°liquid | -2797.98 ± 0.44 | kJ/mol | Ccr | Platonov and Simulin, 1985 | ALS |
Constant pressure heat capacity of liquid
Cp,liquid (J/mol*K) | Temperature (K) | Reference | Comment |
---|---|---|---|
194.90 | 298.15 | Wilhelm, Lainez, et al., 1986 | DH |
194.6 | 298.15 | Wilhelm, Inglese, et al., 1982 | DH |
188. | 297.95 | Petit and TerMinassian, 1974 | T = 297 to 454 K. Value is unsmoothed experimental datum.; DH |

Phase change data

Data compiled as indicated in comments:
BS - Robert L. Brown and Stephen E. Stein
TRC - Thermodynamics Research Center, NIST Boulder Laboratories, Chris Muzny director
AC - William E. Acree, Jr., James S. Chickos
ALS - Hussein Y. Afeefy, Joel F. Liebman, and Stephen E. Stein
Quantity | Value | Units | Method | Reference | Comment |
---|---|---|---|---|---|
Tboil | 486.7 | K | N/A | Weast and Grasselli, 1989 | BS |
Quantity | Value | Units | Method | Reference | Comment |
Tfus | 290.1 | K | N/A | Dreisbach, 1955 | Uncertainty assigned by TRC = 0.02 K; TRC |
Tfus | 282.2 | K | N/A | Galat, 1952 | Uncertainty assigned by TRC = 4. K; TRC |
Tfus | 289.7 | K | N/A | van de Lande, 1932 | Uncertainty assigned by TRC = 3. K; TRC |
Quantity | Value | Units | Method | Reference | Comment |
ΔvapH° | 57.6 | kJ/mol | GC | Spieksma, Luijk, et al., 1994 | Based on data from 413. to 453. K.; AC |
ΔvapH° | 55.5 ± 0.1 | kJ/mol | C | Yan, Gu, et al., 1987, 2 | AC |
ΔvapH° | 55.1 ± 0.5 | kJ/mol | C | Yan, Gu, et al., 1987 | ALS |
ΔvapH° | 54.68 | kJ/mol | E | Platonov and Simulin, 1985 | ALS |
Enthalpy of vaporization
ΔvapH (kJ/mol) | Temperature (K) | Method | Reference | Comment |
---|---|---|---|---|
55.8 | 290. | N/A | Rohác, Ruzicka, et al., 1999 | AC |
49.5 | 406. | EB | Rohác, Ruzicka, et al., 1998 | Based on data from 391. to 490. K.; AC |
47.0 | 288. | RG | Sears and Hopke, 1949 | Based on data from 279. to 298. K.; AC |
49.3 | 326. | N/A | Stull, 1947 | Based on data from 311. to 486. K.; AC |
Antoine Equation Parameters
log10(P) = A − (B / (T + C))
P = vapor pressure (bar)
T = temperature (K)
View plot Requires a JavaScript / HTML 5 canvas capable browser.
Temperature (K) | A | B | C | Reference | Comment |
---|---|---|---|---|---|
311.6 to 486. | 4.64002 | 2110.983 | -30.721 | Stull, 1947 | Coefficents calculated by NIST from author's data. |
Enthalpy of sublimation
ΔsubH (kJ/mol) | Temperature (K) | Method | Reference | Comment |
---|---|---|---|---|
62.3 | 289. | RG | Sears and Hopke, 1949 | Based on data from 279. to 298. K. See also Jones, 1960.; AC |

Reaction thermochemistry data

Data compiled by: John E. Bartmess
Individual Reactions
C6H2Cl3- + =
By formula: C6H2Cl3- + H+ = C6H3Cl3
Quantity | Value | Units | Method | Reference | Comment |
---|---|---|---|---|---|
ΔrH° | 1549. ± 8.8 | kJ/mol | G+TS | Schlosser, Marzi, et al., 2001 | gas phase; Acid: 1,2,4-trichlorobenzene. Anion assigned based on ab initio calculations. |
Quantity | Value | Units | Method | Reference | Comment |
ΔrG° | 1517. ± 8.4 | kJ/mol | IMRE | Schlosser, Marzi, et al., 2001 | gas phase; Acid: 1,2,4-trichlorobenzene. Anion assigned based on ab initio calculations. |

Normal alkane RI, non-polar column, custom temperature program

Data compiled by: NIST Mass Spectrometry Data Center, William E. Wallace, director

Column type CapillaryCapillaryCapillaryCapillaryCapillary
Active phase Methyl SiliconeCP Sil 2Polydimethyl siloxanesSPB-1OV-1
Column length (m)  55. 30.50.
Carrier gas  N2  Hydrogen
Substrate
Column diameter (mm)  0.25 0.320.32
Phase thickness (μm)  0.25
Program not specified40C(3min) => 20C/min => 80C => 2C/min => 240C(45min)not specifiednot specifiednot specified
I 1177.1174.1158.1145.1150.
ReferenceYu and Zazhi, 2005Fuhrer, Deissler, et al., 1997Zenkevich and Chupalov, 1996Vezzani, Moretti, et al., 1994Waggott and Davies, 1984
Comment MSDC-RI MSDC-RI MSDC-RI MSDC-RI MSDC-RI
Column type CapillaryCapillary
Active phase OV-1, SE-30, Methyl silicone, SP-2100, OV-101, DB-1, etc.OV-1, SE-30, Methyl silicone, SP-2100, OV-101, DB-1, etc.
Column length (m) 50.50.
Carrier gas HydrogenHydrogen
Substrate
Column diameter (mm) 0.320.32
Phase thickness (μm)
Program not specifiednot specified
I 1150.1154.
ReferenceWaggott and Davies, 1984Waggott and Davies, 1984
Comment MSDC-RI MSDC-RI

Normal alkane RI, non-polar column, temperature ramp

Data compiled by: NIST Mass Spectrometry Data Center, William E. Wallace, director

Column type CapillaryCapillaryCapillaryCapillaryCapillary
Active phase OV-101OV-101OV-101Ultra-1SE-54
Column length (m) 25.25.25.25.25.
Carrier gas    HeHe
Substrate
Column diameter (mm) 0.200.200.200.320.32
Phase thickness (μm)    0.25
Tstart (C) 80.80.80.80.50.
Tend (C)    260.250.
Heat rate (K/min) 2.2.2.3.8.
Initial hold (min)     2.
Final hold (min)     12.
I 1142.1144.1145.1149.1170.
ReferenceMessadi and Ali-Mokhnache, 1993Messadi and Ali-Mokhnache, 1993Messadi and Ali-Mokhnache, 1993Okumura, 1991Harland, Cumming, et al., 1986
Comment MSDC-RI MSDC-RI MSDC-RI MSDC-RI MSDC-RI

Van Den Dool and Kratz RI, non-polar column, custom temperature program

Data compiled by: NIST Mass Spectrometry Data Center, William E. Wallace, director

Column type CapillaryPacked
Active phase 5 % Phenyl methyl siloxaneSE-30
Column length (m) 25.3.05
Carrier gas He
Substrate  Supelcoport; Chromosorb
Column diameter (mm) 0.31
Phase thickness (μm) 0.52
Program 50C(2min) => (20C/min) => 120C => (7C/min) => 310C(10min)40C(5min) => 10C/min => 200C or 250C (60min)
I 1172.1160.
ReferenceYasuhara, Shiraishi, et al., 1997Peng, Ding, et al., 1988
Comment MSDC-RI MSDC-RI

Normal alkane RI, non-polar column, isothermal

Data compiled by: NIST Mass Spectrometry Data Center, William E. Wallace, director

Column type Packed
Active phase DC-400
Column length (m) 3.0
Carrier gas Helium
Substrate Gas-Pak (60-80 mesh)
Column diameter (mm)
Phase thickness (μm)
Temperature (C) 150.
I 1198.
ReferenceAnderson, 1968
Comment MSDC-RI

Van Den Dool and Kratz RI, polar column, temperature ramp

Data compiled by: NIST Mass Spectrometry Data Center, William E. Wallace, director

Column type CapillaryCapillaryCapillaryCapillary
Active phase DB-WaxDB-WaxDB-WaxDB-Wax
Column length (m) 30.30.30.30.
Carrier gas N2N2N2N2
Substrate
Column diameter (mm) 0.2350.2350.2350.235
Phase thickness (μm) 0.50.50.50.5
Tstart (C) 100.100.50.50.
Tend (C)
Heat rate (K/min) 10.5.10.5.
Initial hold (min)
Final hold (min)
I 1671.431659.761658.541643.59
ReferenceGerbino and Castello, 1995Gerbino and Castello, 1995Gerbino and Castello, 1995Gerbino and Castello, 1995
Comment MSDC-RI MSDC-RI MSDC-RI MSDC-RI

References

Yan, Gu, et al., 1987
Yan, H.; Gu, J.; An, X.; Hu, R.,
Standard enthalpies of formation and enthlpies of isomerization of trichlorobenzenes,
Huaxue Xuebao, 1987, 45, 1184-1187. [all data]
Platonov and Simulin, 1985
Platonov, V.A.; Simulin, Yu.N.,
Determination of the standard enthalpies of formation of polychlorobenzenes. III. The standard enthalpies of formation of mono-1,2,4- and 1,3,5-tri-, and 1,2,3,4- and 1,2,3,5-tetrachlorobenzenes,
Russ. J. Phys. Chem. (Engl. Transl.), 1985, 59, 179-181. [all data]
Wilhelm, Lainez, et al., 1986
Wilhelm, E.; Lainez, A.; Roux, A.H.; Grolier, J.-P.E.,
Excess-molar volumes and heat capacities of (1,2,4-trichlorobenzene + an n-alkane) and (1-chloronaphthalene + an n-alkane),
Thermochim. Acta, 1986, 105, 101-110. [all data]
Wilhelm, Inglese, et al., 1982
Wilhelm, E.; Inglese, A.; Quint, J.R.; Grolier, J.-P.E.,
Molar excess volumes and excess heat capacities of (1,2,4-trichlorobenzene + an alkane),
J. Chem. Thermodynam., 1982, 14, 303-308. [all data]
Petit and TerMinassian, 1974
Petit, J.C.; TerMinassian, L.,
Measurements of (dV/dT)p, (dV/dP)T, and (dH/dT)p by flux calorimetry,
J. Chem. Thermodynam., 1974, 6, 1139-1152. [all data]
Weast and Grasselli, 1989
CRC Handbook of Data on Organic Compounds, 2nd Editon, Weast,R.C and Grasselli, J.G., ed(s)., CRC Press, Inc., Boca Raton, FL, 1989, 1. [all data]
Dreisbach, 1955
Dreisbach, R.R.,
Physical Properties of Chemical Compounds, Advances in Chemistry Series No. 15, Am. Chem. Soc.: Washington, D. C., 1955. [all data]
Galat, 1952
Galat, A.,
The Preparation of 2,3,5-Trichlorophenoxyacetic acid (2,4,5-T),
J. Am. Chem. Soc., 1952, 74, 3890-1. [all data]
van de Lande, 1932
van de Lande, L.M.F.,
The Action of Sodium Methylate on SOme Derivatives of m-Dichlorobenzene,
Recl. Trav. Chim. Pays-Bas, 1932, 51, 98-113. [all data]
Spieksma, Luijk, et al., 1994
Spieksma, Walter; Luijk, Ronald; Govers, Harrie A.J.,
Determination of the liquid vapour pressure of low-volatility compounds from the Kováts retention index,
Journal of Chromatography A, 1994, 672, 1-2, 141-148, https://doi.org/10.1016/0021-9673(94)80602-0
. [all data]
Yan, Gu, et al., 1987, 2
Yan, H.; Gu, J.; An, X.; Hu, R.-H.,
Huaxue Xuebao, 1987, 45, 1184. [all data]
Rohác, Ruzicka, et al., 1999
Rohác, Vladislav; Ruzicka, Vlastimil; Ruzicka, Kvetoslav; Polednicek, Milos; Aim, Karel; Jose, Jacques; Zábranský, Milan,
Recommended vapour and sublimation pressures and related thermal data for chlorobenzenes,
Fluid Phase Equilibria, 1999, 157, 1, 121-142, https://doi.org/10.1016/S0378-3812(99)00003-5
. [all data]
Rohác, Ruzicka, et al., 1998
Rohác, Vladislav; Ruzicka, Vlastimil; Ruzicka, Kvetoslav; Aim, Karel,
Measurements of Saturated Vapor Pressure above the Liquid Phase for Isomeric Dichlorobenzenes and 1,2,4-Trichlorobenzene,
J. Chem. Eng. Data, 1998, 43, 5, 770-775, https://doi.org/10.1021/je9701442
. [all data]
Sears and Hopke, 1949
Sears, G.W.; Hopke, E.R.,
Vapor Pressures of the Isomeric Trichlorobenzenes in the Low Pressure Region,
J. Am. Chem. Soc., 1949, 71, 7, 2575-2576, https://doi.org/10.1021/ja01175a094
. [all data]
Stull, 1947
Stull, Daniel R.,
Vapor Pressure of Pure Substances. Organic and Inorganic Compounds,
Ind. Eng. Chem., 1947, 39, 4, 517-540, https://doi.org/10.1021/ie50448a022
. [all data]
Jones, 1960
Jones, A.H.,
Sublimation Pressure Data for Organic Compounds.,
J. Chem. Eng. Data, 1960, 5, 2, 196-200, https://doi.org/10.1021/je60006a019
. [all data]
Schlosser, Marzi, et al., 2001
Schlosser, M.; Marzi, E.; Cottet, F.; Buker, H.H.; Nibbering, N.M.M.,
The acidity of chloro-substituted benzenes: A comparison of gas phase, ab initio, and kinetic data,
Chem. Eur. J., 2001, 7, 16, 3511-3516, https://doi.org/10.1002/1521-3765(20010817)7:16<3511::AID-CHEM3511>3.0.CO;2-U
. [all data]