triethyldialuminium trichloride

Reaction thermochemistry data

Data compiled by: José A. Martinho Simões

Individual Reactions

Aluminum, dichloroethyl- (l) + Aluminum, chlorodiethyl- (l) = C6H15Al2Cl3 (l)

By formula: C2H5AlCl2 (l) + C4H10AlCl (l) = C6H15Al2Cl3 (l)

Quantity Value Units Method Reference Comment
Δr-0.55 ± 0.05kcal/molRSCSmith, 1974Please also see Pedley and Rylance, 1977.

References

Smith, 1974
Smith, M.B., J. Organometal. Chem., 1974, 76, 171. [all data]

Pedley and Rylance, 1977
Pedley, J.B.; Rylance, J., Computer Analysed Thermochemical Data: Organic and Organometallic Compounds, University of Sussex, Brigton, 1977. [all data]