Benzothiazole, 2-methyl-

Phase change data

Data compiled as indicated in comments:
BS - Robert L. Brown and Stephen E. Stein
AC - William E. Acree, Jr., James S. Chickos

Quantity Value Units Method Reference Comment
Tboil511.2KN/AWeast and Grasselli, 1989BS

Reduced pressure boiling point

Tboil (K) Pressure (bar) Reference Comment
423.70.020Weast and Grasselli, 1989BS

Enthalpy of vaporization

ΔvapH (kJ/mol) Temperature (K) Method Reference Comment
61.3358.AStephenson and Malanowski, 1987Based on data from 343. - 499. K. See also Stull, 1947 and Dykyj, Svoboda, et al., 1999.; AC

Antoine Equation Parameters

log10(P) = A − (B / (T + C))
    P = vapor pressure (bar)
    T = temperature (K)

View plot Requires a JavaScript / HTML 5 canvas capable browser.

Temperature (K) A B C Reference Comment
343. - 498.75.864072765.156-26.799Stull, 1947Coefficents calculated by NIST from author's data.

Van Den Dool and Kratz RI, non-polar column, custom temperature program

View large format table.

Column type Active phase I Reference Comment
Capillary5 % Phenyl methyl siloxane1288.Yasuhara, Shiraishi, et al., 199725. m/0.31 mm/0.52 μm, He; Program: 50C(2min) => (20C/min) => 120C => (7C/min) => 310C(10min)

Normal alkane RI, non-polar column, custom temperature program

View large format table.

Column type Active phase I Reference Comment
CapillaryTR-5 MS1273.Kurashov, Mitrukova, et al., 201415. m/0.25 mm/0.25 μm, Helium; Program: 35 0C (3 min) 2 0C/min -> 60 0C (3 min) 2 0C/min -> 80 0C (3 min) 4 0C/min -> 120 0C (3 min) 5 0C/min -> 150 0C (3 min) 15 0C/min -> 240 0C (10 min)

Gas phase ion energetics data

Data compiled by: Sharon G. Lias, Rhoda D. Levin, and Sherif A. Kafafi

Ionization energy determinations

IE (eV) Method Reference Comment
8.65PESalmona, Faure, et al., 1975Vertical value

References

Weast and Grasselli, 1989
CRC Handbook of Data on Organic Compounds, 2nd Editon, Weast,R.C and Grasselli, J.G., ed(s)., CRC Press, Inc., Boca Raton, FL, 1989, 1. [all data]

Stephenson and Malanowski, 1987
Stephenson, Richard M.; Malanowski, Stanislaw, Handbook of the Thermodynamics of Organic Compounds, 1987, https://doi.org/10.1007/978-94-009-3173-2 . [all data]

Stull, 1947
Stull, Daniel R., Vapor Pressure of Pure Substances. Organic and Inorganic Compounds, Ind. Eng. Chem., 1947, 39, 4, 517-540, https://doi.org/10.1021/ie50448a022 . [all data]

Dykyj, Svoboda, et al., 1999
Dykyj, J.; Svoboda, J.; Wilhoit, R.C.; Frenkel, M.L.; Hall, K.R., Vapor Pressure of Chemicals: Part A. Vapor Pressure and Antoine Constants for Hydrocarbons and Sulfur, Selenium, Tellurium and Hydrogen Containing Organic Compounds, Springer, Berlin, 1999, 373. [all data]