Dibenzothiophene, 4,6-dimethyl-

Normal alkane RI, non-polar column, temperature ramp

Data compiled by: NIST Mass Spectrometry Data Center, William E. Wallace, director

Column type CapillaryCapillary
Active phase DB-PetroPONA
Column length (m) 50.50.
Carrier gas He
Substrate
Column diameter (mm) 0.200.20
Phase thickness (μm) 0.500.50
Tstart (C) 35.120.
Tend (C) 300.270.
Heat rate (K/min) 2.1.5
Initial hold (min) 5.
Final hold (min) 5.10.
I 2033.2029.
ReferenceLu, Wu, et al., 2004Yang, Wang, et al., 2002
Comment MSDC-RI MSDC-RI

Normal alkane RI, non-polar column, custom temperature program

View large format table.

Column type Active phase I Reference Comment
CapillaryDB-Petro2029.Lu, Wu, et al., 200450. m/0.20 mm/0.50 μm, He; Program: not specified

Lee's RI, non-polar column, temperature ramp

View large format table.

Column type Active phase I Reference Comment
CapillaryRxi-5 MS328.80Zeigler, Schantz, et al., 201230. m/0.25 mm/0.25 μm, Helium, 60. C @ 1. min, 5. K/min, 340. C @ 0. min
CapillaryDB-5MS327.55Schade and Andersson, 200630. m/0.25 mm/0.25 μm, He, 60. C @ 1. min, 10. K/min; Tend: 300. C
CapillaryHP-5MS328.32Zhou, Wang, et al., 200430. m/0.25 mm/0.25 μm, 65. C @ 5. min, 3. K/min, 290. C @ 20. min
CapillaryDB-5329.46Williams and Bottrill, 1995He, 60. C @ 2. min, 5. K/min; Column length: 25. m; Column diameter: 0.3 mm; Tend: 270. C
CapillarySE-30329.68Wang, Xue, et al., 1994Nitrogen, 4. K/min; Column length: 25. m; Column diameter: 0.20 mm; Tstart: 80. C; Tend: 290. C
CapillaryDB-5329.2Palmentier, Britten, et al., 198980. C @ 1. min, 3.5 K/min, 300. C @ 10. min; Column length: 30. m; Column diameter: 0.32 mm
CapillaryDB-5333.6Viau, Studak, et al., 1984Helium, 4. K/min; Column length: 30. m; Column diameter: 0.32 mm; Tstart: 90. C; Tend: 250. C
CapillarySE-52329.17Vassilaros, Kong, et al., 198220. m/0.30 mm/0.25 μm, H2, 40. C @ 2. min, 4. K/min; Tend: 265. C

Lee's RI, non-polar column, custom temperature program

View large format table.

Column type Active phase I Reference Comment
CapillaryHP-5MS327.77Zhou, Wang, et al., 200430. m/0.25 mm/0.25 μm; Program: not specified
CapillaryDB-5325.75Mössner, de Alda, et al., 199960. m/0.25 mm/0.25 μm, He; Program: 60C (1 min) => 45 C/min => 150C (2 min) => 2 C/min => 300 C (25 min)
CapillarySE-30329.17Wang, Xue, et al., 1994Nitrogen; Column length: 25. m; Column diameter: 0.20 mm; Program: not specified
CapillaryDB-5329.6Paschke, Herbel, et al., 199230. m/0.25 mm/0.25 μm, He; Program: 60 0C (3 min) 10 0C/min -> 100 0C (3 min) 5 0C/min -> 300 0C
CapillaryCP Sil 8 CB329.2Bundt, Herbel, et al., 199150. m/0.25 mm/0.25 μm, He; Program: not specified
CapillaryCP Sil 8 CB329.2Bundt, Herbel, et al., 199150. m/0.25 mm/0.25 μm, He; Program: not specified

References

Lu, Wu, et al., 2004
Lu, X.; Wu, J.; Wu, J.; Kong, H.; Hua, R.; Tao, W.; Gu, J.; Xu, G., Characterization and quantitative determination of diesel fractions by comprehensive two-dimensional gas chromatography/time of flight mass spectrometry, Chin. J. Chromatogr., 2004, 22, 1, 5-11. [all data]

Yang, Wang, et al., 2002
Yang, Y.-T.; Wang, H.-Y.; Lu, W.-Z., Determination od sulfur compounds in catalytic diesel oil by gas chromatography with atomic emission detector and its application, Chin. J. Chromatogr., 2002, 20, 6, 493-497. [all data]