(E)-Sesquilavandulol

Normal alkane RI, polar column, temperature ramp

Data compiled by: NIST Mass Spectrometry Data Center, William E. Wallace, director

Column type Capillary
Active phase Innowax
Column length (m) 60.
Carrier gas He
Substrate
Column diameter (mm) 0.25
Phase thickness (μm)
Tstart (C) 60.
Tend (C) 220.
Heat rate (K/min) 4.
Initial hold (min) 10.
Final hold (min) 10.
I 2183.
ReferenceSuleimenov, Atazharova, et al., 2003
Comment MSDC-RI

References

Suleimenov, Atazharova, et al., 2003
Suleimenov, E.M.; Atazharova, G.A.; Demirchi, B.; Baser, K.H.C.; Adekenov, S.M., Essential oil composition of Artemisia Lercheana and A. Sieversiana of Kazakhstan flora in Recent problems of development of new medicines of natural origin, Proceedings of symposium, St.Petersburg - Pushkin, 2003, 382-385. [all data]