Disilicon carbide

Gas phase thermochemistry data

Quantity Value Units Method Reference Comment
Δfgas128.00kcal/molReviewChase, 1998Data last reviewed in March, 1966
Quantity Value Units Method Reference Comment
gas,1 bar57.909cal/mol*KReviewChase, 1998Data last reviewed in March, 1966

Gas Phase Heat Capacity (Shomate Equation)

Cp° = A + B*t + C*t2 + D*t3 + E/t2
H° − H°298.15= A*t + B*t2/2 + C*t3/3 + D*t4/4 − E/t + F − H
S° = A*ln(t) + B*t + C*t2/2 + D*t3/3 − E/(2*t2) + G
    Cp = heat capacity (cal/mol*K)
    H° = standard enthalpy (kcal/mol)
    S° = standard entropy (cal/mol*K)
    t = temperature (K) / 1000.

View plot Requires a JavaScript / HTML 5 canvas capable browser.

View table.

Temperature (K) 298. - 1200.1200. - 6000.
A 9.31219014.99970
B 10.00030-1.674341
C -7.1372610.979375
D 1.876980-0.101708
E -0.0333050.166489
F 124.7270122.8300
G 66.3088074.65129
H 128.0000128.0000
ReferenceChase, 1998Chase, 1998
Comment Data last reviewed in March, 1966 Data last reviewed in March, 1966

Vibrational and/or electronic energy levels

Data compiled by: Marilyn E. Jacox

State:   X

Vib.
sym.
 No.   Approximate
 type of mode
 cm-1   Med.   Method   References

a1 1 Sym. stretch 839.5 Ar IR Presilla-Marquez and Graham, 1991
2 Bend 166.4 T Ar IR Presilla-Marquez and Graham, 1991
b2 3 Asym. stretch 1188.4 s Ar IR Kafafi, Hauge, et al., 1983
Presilla-Marquez and Graham, 1991

Additional references: Jacox, 1994, page 67

References

Chase, 1998
Chase, M.W., Jr., NIST-JANAF Themochemical Tables, Fourth Edition, J. Phys. Chem. Ref. Data, Monograph 9, 1998, 1-1951. [all data]