germanium selenide

Gas phase ion energetics data

Data compiled as indicated in comments:
LL - Sharon G. Lias and Joel F. Liebman
LLK - Sharon G. Lias, Rhoda D. Levin, and Sherif A. Kafafi

Ionization energy determinations

IE (eV) Method Reference Comment
10.5EIBalducci, Sacconi, et al., 1991LL
9.8PEWhite, Rosenberg, et al., 1979Vertical value; LLK
9.95PEWu and Fehlner, 1976Vertical value; LLK
10.2 ± 0.5EIWu and Fehlner, 1976Vertical value; LLK

Appearance energy determinations

Ion AE (eV) Other Products MethodReferenceComment
Ge+13.8SeEIBalducci, Sacconi, et al., 1991LL
Se+17.5GeEIBalducci, Sacconi, et al., 1991LL

References

Balducci, Sacconi, et al., 1991
Balducci, G.; Sacconi, L.V.; Gigli, G., The dimerization energies of the Ge2S2, Ge2Se2, and Ge2Te2 molecules, Ber. Bunsen-Ges. Phys. Chem., 1991, 95, 1651. [all data]

White, Rosenberg, et al., 1979
White, M.G.; Rosenberg, R.A.; Lee, S.T.; Shirley, D.A., The He(I) photoelectron spectroscopy of heavy group IV-VI diatomics, J. Electron Spectrosc. Relat. Phenom., 1979, 17, 323. [all data]

Wu and Fehlner, 1976
Wu, M.; Fehlner, T.P., Valence level photoelectron spectra of some heavy group 4-6 diatomic molecules, J. Am. Chem. Soc., 1976, 98, 7578. [all data]