gallium antimonide

Gas phase ion energetics data

Data compiled by: Sharon G. Lias, Rhoda D. Levin, and Sherif A. Kafafi

Ionization energy determinations

IE (eV) Method Reference
7.6 ± 1.0EIPiacente and Balducci, 1974

References

Piacente and Balducci, 1974
Piacente, V.; Balducci, G., The dissociation energy of the molecule GaSb, High Temp. Sci., 1974, 6, 254. [all data]