dilithium oxide

Gas phase ion energetics data

Data evaluated as indicated in comments:
HL - Edward P. Hunter and Sharon G. Lias

Data compiled as indicated in comments:
LBLHLM - Sharon G. Lias, John E. Bartmess, Joel F. Liebman, John L. Holmes, Rhoda D. Levin, and W. Gary Mallard
LLK - Sharon G. Lias, Rhoda D. Levin, and Sherif A. Kafafi
RDSH - Henry M. Rosenstock, Keith Draxl, Bruce W. Steiner, and John T. Herron

Quantity Value Units Method Reference Comment
Proton affinity (review)1206.kJ/molN/AHunter and Lias, 1998HL
Quantity Value Units Method Reference Comment
Gas basicity1175.3kJ/molN/AHunter and Lias, 1998HL

Ionization energy determinations

IE (eV) Method Reference Comment
6.0EIIkeda, Tamaki, et al., 1982LBLHLM
6.4 ± 0.2EINakagawa, Asano, et al., 1981LLK
6.19 ± 0.20EIHildenbrand, 1972LLK
6.3 ± 1.0EIYamdagni, Pupp, et al., 1970RDSH
7.0 ± 0.5EIZmbov, Ficalora, et al., 1968RDSH
6.9 ± 0.3EIWhite, Seshadri, et al., 1963RDSH
6.8 ± 0.2EIBerkowitz, Chupka, et al., 1959RDSH

Gas phase thermochemistry data

Quantity Value Units Method Reference Comment
Δfgas-39.900kcal/molReviewChase, 1998Data last reviewed in March, 1964
Quantity Value Units Method Reference Comment
gas,1 bar54.759cal/mol*KReviewChase, 1998Data last reviewed in March, 1964

Gas Phase Heat Capacity (Shomate Equation)

Cp° = A + B*t + C*t2 + D*t3 + E/t2
H° − H°298.15= A*t + B*t2/2 + C*t3/3 + D*t4/4 − E/t + F − H
S° = A*ln(t) + B*t + C*t2/2 + D*t3/3 − E/(2*t2) + G
    Cp = heat capacity (cal/mol*K)
    H° = standard enthalpy (kcal/mol)
    S° = standard entropy (cal/mol*K)
    t = temperature (K) / 1000.

View plot Requires a JavaScript / HTML 5 canvas capable browser.

View table.

Temperature (K) 4000. - 6000.
A 14.68350
B 0.151136
C -0.035544
D 0.002754
E -0.395083
F -45.48829
G 70.60060
H -39.90010
ReferenceChase, 1998
Comment Data last reviewed in March, 1964

Condensed phase thermochemistry data

Quantity Value Units Method Reference Comment
Δfliquid-132.23kcal/molReviewChase, 1998Data last reviewed in March, 1964
Quantity Value Units Method Reference Comment
liquid,1 bar13.16cal/mol*KReviewChase, 1998Data last reviewed in March, 1964
Quantity Value Units Method Reference Comment
Δfsolid-143.10kcal/molReviewChase, 1998Data last reviewed in March, 1964
Quantity Value Units Method Reference Comment
solid9.046cal/mol*KReviewChase, 1998Data last reviewed in March, 1964

Liquid Phase Heat Capacity (Shomate Equation)

Cp° = A + B*t + C*t2 + D*t3 + E/t2
H° − H°298.15= A*t + B*t2/2 + C*t3/3 + D*t4/4 − E/t + F − H
S° = A*ln(t) + B*t + C*t2/2 + D*t3/3 − E/(2*t2) + G
    Cp = heat capacity (cal/mol*K)
    H° = standard enthalpy (kcal/mol)
    S° = standard entropy (cal/mol*K)
    t = temperature (K) / 1000.

View plot Requires a JavaScript / HTML 5 canvas capable browser.

View table.

Temperature (K) 1843. - 4000.
A 24.00000
B -0.000006
C 0.000002
D -1.689836×10-7
E -0.000005
F -141.8671
G 36.27127
H -132.2292
ReferenceChase, 1998
Comment Data last reviewed in March, 1964

Solid Phase Heat Capacity (Shomate Equation)

Cp° = A + B*t + C*t2 + D*t3 + E/t2
H° − H°298.15= A*t + B*t2/2 + C*t3/3 + D*t4/4 − E/t + F − H
S° = A*ln(t) + B*t + C*t2/2 + D*t3/3 − E/(2*t2) + G
    Cp = heat capacity (cal/mol*K)
    H° = standard enthalpy (kcal/mol)
    S° = standard entropy (cal/mol*K)
    t = temperature (K) / 1000.

View plot Requires a JavaScript / HTML 5 canvas capable browser.

View table.

Temperature (K) 298. - 1600.1600. - 1843.
A 16.4190023.61580
B 1.3066800.073781
C 5.5408900.410053
D -2.269511-0.034789
E -0.382992-3.561420
F -149.3870-157.9710
G 26.1455127.62651
H -143.1000-143.1000
ReferenceChase, 1998Chase, 1998
Comment Data last reviewed in March, 1964 Data last reviewed in March, 1964

References

Hunter and Lias, 1998
Hunter, E.P.; Lias, S.G., Evaluated Gas Phase Basicities and Proton Affinities of Molecules: An Update, J. Phys. Chem. Ref. Data, 1998, 27, 3, 413-656, https://doi.org/10.1063/1.556018 . [all data]

Ikeda, Tamaki, et al., 1982
Ikeda, Y.; Tamaki, M.; Matsumoto, G.; Amioka, K.; Mizuno, T., Mass spectrometric studies of lithium-containing oxides at high temperatures, Spectrochim. Acta Part B, 1982, 37, 647. [all data]

Nakagawa, Asano, et al., 1981
Nakagawa, H.; Asano, M.; Kubo, K., Mass spectrometric study of the vaporization of lithium metasilicate, J. Nucl. Mater., 1981, 102, 292. [all data]

Hildenbrand, 1972
Hildenbrand, D.L., Thermochemistry of the molecular species LiO, LiO+, and Li2O+., J. Chem. Phys., 1972, 57, 4556. [all data]

Yamdagni, Pupp, et al., 1970
Yamdagni, R.; Pupp, C.; Porter, R.F., Mass spectrometric study of the evaporation of lithium and sodium molybdates and tungstates, J. Inorg. Nucl. Chem., 1970, 32, 3509. [all data]

Zmbov, Ficalora, et al., 1968
Zmbov, K.F.; Ficalora, P.; Margrave, J.L., Mass spectrometric studies at high temperatures. XXVIII. Gaseous ternary oxides, LiMO and LiMO2, J. Inorg. Nucl. Chem., 1968, 30, 2059. [all data]

White, Seshadri, et al., 1963
White, D.; Seshadri, K.S.; Dever, D.F.; Mann, D.E.; Linevski, M.J., Infrared spectra and the structures and thermodynamics of gaseous LiO, Li2O, and Li2O2, J. Chem. Phys., 1963, 39, 2463. [all data]

Berkowitz, Chupka, et al., 1959
Berkowitz, J.; Chupka, W.A.; Blue, G.D.; Margrave, J.L., Mass spectrometric study of the sublimation of lithium oxide, J. Phys. Chem., 1959, 63, 644. [all data]