Benzyl Benzoate

Kovats' RI, non-polar column, temperature ramp

Data compiled by: NIST Mass Spectrometry Data Center, William E. Wallace, director

Column type CapillaryCapillaryCapillaryCapillaryCapillary
Active phase BP-1CP Sil 8 CBCP Sil 8 CBCP Sil 8 CBDB-5
Column length (m) 25.30.30.30.30.
Carrier gas N2H2H2H2He
Substrate
Column diameter (mm) 0.320.250.250.250.25
Phase thickness (μm) 0.250.250.250.250.25
Tstart (C) 60.50.50.50.60.
Tend (C) 220.220.220.220.240.
Heat rate (K/min) 5.3.3.3.3.
Initial hold (min)  2.2.2.
Final hold (min) 13.   30.
I 1730.1755.1755.1729.1750.
ReferenceRaina, Verma, et al., 2006Tayoub, Schwob, et al., 2006Tayoub, Schwob, et al., 2006, 2Schwob, Bessiere, et al., 2004Marongiu, Piras, et al., 2003
Comment MSDC-RI MSDC-RI MSDC-RI MSDC-RI MSDC-RI
Column type CapillaryCapillaryCapillaryCapillaryCapillary
Active phase BP-1PTE-5Methyl SiliconeSPB-1OV-101
Column length (m) 25.60.30.30.100.
Carrier gas N2H2HeHeH2
Substrate
Column diameter (mm) 0.320.320.320.320.3
Phase thickness (μm) 0.250.390.250.250.15
Tstart (C) 60.60.60.60.90.
Tend (C) 220.285.225.250.220.
Heat rate (K/min) 5.4.32.5.2.
Initial hold (min)   2.2.
Final hold (min) 15. 5.5.
I 1744.1768.1741.1731.1724.
ReferenceRaina, Srivastava, et al., 2003Gudzic, Dordevic, et al., 2001Jayaprakasha, Rao, et al., 2000Jayaprakasha, Jaganmohan Rao, et al., 1997Gaydou, Randriamiharisoa, et al., 1986
Comment MSDC-RI MSDC-RI MSDC-RI MSDC-RI MSDC-RI

Kovats' RI, non-polar column, isothermal

Data compiled by: NIST Mass Spectrometry Data Center, William E. Wallace, director

Column type CapillaryCapillaryCapillaryCapillaryCapillary
Active phase SE-30SE-30SE-30SE-30SE-30
Column length (m) 40.25.25.25.25.
Carrier gas  N2N2N2N2
Substrate
Column diameter (mm) 0.350.330.330.330.33
Phase thickness (μm) 0.35
Temperature (C) 100.140.160.180.180.
I 1736.21712.1725.1741.1741.
ReferenceTudor, 1997Korhonen, 1986Korhonen, 1986Korhonen, 1986Korhonen, 1986
Comment MSDC-RI MSDC-RI MSDC-RI MSDC-RI MSDC-RI
Column type CapillaryCapillaryCapillary
Active phase SE-30SE-30SE-30
Column length (m) 25.25.25.
Carrier gas N2N2N2
Substrate
Column diameter (mm) 0.330.330.33
Phase thickness (μm)
Temperature (C) 200.220.240.
I 1756.1771.1789.
ReferenceKorhonen, 1986Korhonen, 1986Korhonen, 1986
Comment MSDC-RI MSDC-RI MSDC-RI

Kovats' RI, polar column, isothermal

Data compiled by: NIST Mass Spectrometry Data Center, William E. Wallace, director

Column type CapillaryCapillaryCapillaryCapillaryCapillary
Active phase Carbowax 20MOV-351OV-351OV-351OV-351
Column length (m)  25.25.25.25.
Carrier gas  N2N2N2N2
Substrate
Column diameter (mm)  0.320.320.320.32
Phase thickness (μm) 0.08
Temperature (C) 180.180.180.200.220.
I 2569.2576.2576.2607.2636.
ReferenceTudor, Moldovan, et al., 1999Korhonen, 1986Korhonen, 1986Korhonen, 1986Korhonen, 1986
Comment MSDC-RI MSDC-RI MSDC-RI MSDC-RI MSDC-RI

Kovats' RI, polar column, temperature ramp

Data compiled by: NIST Mass Spectrometry Data Center, William E. Wallace, director

Column type Capillary
Active phase Carbowax 20M
Column length (m) 50.
Carrier gas
Substrate
Column diameter (mm) 0.23
Phase thickness (μm)
Tstart (C) 80.
Tend (C) 200.
Heat rate (K/min) 2.
Initial hold (min)
Final hold (min)
I 2566.
ReferenceToda, Mihara, et al., 1983
Comment MSDC-RI

References

Raina, Verma, et al., 2006
Raina, V.K.; Verma, S.C.; Dhawan, S.; Khan, M.; Ramesh, S.; Singh, S.C.; Yadav, A.; Srivastava, S.K., Essential oil composition of Murraya exotica from the plains of northern India, Flavour Fragr. J., 2006, 21, 1, 140-142, https://doi.org/10.1002/ffj.1547 . [all data]

Tayoub, Schwob, et al., 2006
Tayoub, G.; Schwob, I.; Bessiere, J.-M.; Masotti, V.; Rabier, J.; Ruzzier, M.; Viano, J., Composition of volatile oils of Styrax (Styrax officinalis L.) leaves at different phenological stages, Biochem. Syst. Ecol., 2006, 34, 9, 705-709, https://doi.org/10.1016/j.bse.2006.05.008 . [all data]

Tayoub, Schwob, et al., 2006, 2
Tayoub, G.; Schwob, I.; Bessière, J.-M.; Rabier, J.; Masotti, V.; J.; M.; Girard, G.; Viano, J., Essential oil composition of leaf, flower and stem of Styrax (Styrax officinalis L.) from south-eastern France, Flavour Fragr. J., 2006, 21, 5, 809-812, https://doi.org/10.1002/ffj.1731 . [all data]

Schwob, Bessiere, et al., 2004
Schwob, I.; Bessiere, J.-M.; Masotti, V.; Viano, J., Changes in essential oil composition in Saint John's wort (Hypericum perforatum L.) aerial parts during its phenological cycle, Biochem. Syst. Ecol., 2004, 32, 8, 735-745, https://doi.org/10.1016/j.bse.2003.12.005 . [all data]

Marongiu, Piras, et al., 2003
Marongiu, B.; Piras, A.; Pani, F.; Porcedda, S.; Ballero, M., Extraction, separation and isolation of essential oils from natural matrices by supercritical CO2, Flavour Fragr. J., 2003, 18, 6, 505-509, https://doi.org/10.1002/ffj.1258 . [all data]

Raina, Srivastava, et al., 2003
Raina, V.K.; Srivastava, S.K.; Syamasunder, K.V., Essential oil composition of Acorus calamus L. from the lower region of the Himalayas, Flavour Fragr. J., 2003, 18, 1, 18-20, https://doi.org/10.1002/ffj.1136 . [all data]

Gudzic, Dordevic, et al., 2001
Gudzic, B.; Dordevic, S.; Palic, R.; Stojanovic, G., Essential oils of Hypericum olympicum L. and Hypericum perforatum L., Flavour Fragr. J., 2001, 16, 3, 201-203, https://doi.org/10.1002/ffj.978 . [all data]

Jayaprakasha, Rao, et al., 2000
Jayaprakasha, G.K.; Rao, L.J.M.; Sakariah, K.K., Chemical composition of the flower oil of Cinnamomum zeylanicum blume, J. Agric. Food Chem., 2000, 48, 9, 4294-4295, https://doi.org/10.1021/jf991395c . [all data]

Jayaprakasha, Jaganmohan Rao, et al., 1997
Jayaprakasha, G.K.; Jaganmohan Rao, L.; Sakariah, K.K., Chemical composition of the volatile oil from the fruits of Cinnamomum zeylanicum blume, Flavour Fragr. J., 1997, 12, 5, 331-333, https://doi.org/10.1002/(SICI)1099-1026(199709/10)12:5<331::AID-FFJ663>3.0.CO;2-X . [all data]

Gaydou, Randriamiharisoa, et al., 1986
Gaydou, E.M.; Randriamiharisoa, R.; Bianchini, J.-P., Composition of the essential oil of ylang-ylang (Canaga odorata Hook Fil. et Thomson forma genuina) from Madagascar, J. Agric. Food Chem., 1986, 34, 3, 481-487, https://doi.org/10.1021/jf00069a028 . [all data]