titanium diboride

Condensed phase thermochemistry data

Quantity Value Units Method Reference Comment
Δfliquid-188.03kJ/molReviewChase, 1998Data last reviewed in June, 1965
Quantity Value Units Method Reference Comment
liquid,1 bar56.28J/mol*KReviewChase, 1998Data last reviewed in June, 1965
Quantity Value Units Method Reference Comment
Δfsolid-279.49kJ/molReviewChase, 1998Data last reviewed in June, 1965
Quantity Value Units Method Reference Comment
solid28.53J/mol*KReviewChase, 1998Data last reviewed in June, 1965

Liquid Phase Heat Capacity (Shomate Equation)

Cp° = A + B*t + C*t2 + D*t3 + E/t2
H° − H°298.15= A*t + B*t2/2 + C*t3/3 + D*t4/4 − E/t + F − H
S° = A*ln(t) + B*t + C*t2/2 + D*t3/3 − E/(2*t2) + G
    Cp = heat capacity (J/mol*K)
    H° = standard enthalpy (kJ/mol)
    S° = standard entropy (J/mol*K)
    t = temperature (K) / 1000.

View plot Requires a JavaScript / HTML 5 canvas capable browser.

View table.

Temperature (K) 3193. - 6000.
A 108.7840
B -2.522786×10-7
C 4.983437×10-8
D -3.369619×10-9
E -5.362299×10-7
F -274.2219
G 115.4679
H -188.0294
ReferenceChase, 1998
Comment Data last reviewed in June, 1965

Solid Phase Heat Capacity (Shomate Equation)

Cp° = A + B*t + C*t2 + D*t3 + E/t2
H° − H°298.15= A*t + B*t2/2 + C*t3/3 + D*t4/4 − E/t + F − H
S° = A*ln(t) + B*t + C*t2/2 + D*t3/3 − E/(2*t2) + G
    Cp = heat capacity (J/mol*K)
    H° = standard enthalpy (kJ/mol)
    S° = standard entropy (J/mol*K)
    t = temperature (K) / 1000.

View plot Requires a JavaScript / HTML 5 canvas capable browser.

View table.

Temperature (K) 298. - 3193.
A 52.33264
B 33.69484
C -7.909266
D 0.803989
E -1.540905
F -301.6844
G 73.49280
H -279.4912
ReferenceChase, 1998
Comment Data last reviewed in June, 1965

References

Chase, 1998
Chase, M.W., Jr., NIST-JANAF Themochemical Tables, Fourth Edition, J. Phys. Chem. Ref. Data, Monograph 9, 1998, 1-1951. [all data]