Al124

Gas phase ion energetics data

Data compiled by: John E. Bartmess

Electron affinity determinations

EA (eV) Method Reference Comment
3.600 ± 0.060LPESLi, Wu, et al., 1998

References

Li, Wu, et al., 1998
Li, X.; Wu, H.; Wang, X.; Wang, L., s-p Hybridization and Electron Shell Structures in Aluminum Clusters: A photoelectron Spectroscopy Study, Phys. Rev. Lett., 1998, 81, 9, 1909, https://doi.org/10.1103/PhysRevLett.81.1909 . [all data]