Rhodium, compound with yttrium(1:1)

Gas phase ion energetics data

Data compiled by: Sharon G. Lias, Rhoda D. Levin, and Sherif A. Kafafi

Ionization energy determinations

IE (eV) Method Reference
7.2 ± 1.0EIHaque and Gingerich, 1979

References

Haque and Gingerich, 1979
Haque, R.; Gingerich, K.A., Investigation of the thermodynamic stabilities of the gaseous molecules RhScC, RhScC2 RhYC2 by Knudsen effusion mass spectrometry, J. Chem. Soc. Faraday Trans. 2, 1979, 985. [all data]