tetraphosphorus heptasulphide

Gas phase ion energetics data

Data compiled by: Sharon G. Lias, Rhoda D. Levin, and Sherif A. Kafafi

Ionization energy determinations

IE (eV) Method Reference
10.1 ± 0.5EIMuenow and Margrave, 1972

References

Muenow and Margrave, 1972
Muenow, D.W.; Margrave, J.L., Mass spectrometric observations of gaseous phosphorus sulfides and oxysulfides, J. Inorg. Nucl. Chem., 1972, 34, 89. [all data]