Osmium trioxide

Gas phase ion energetics data

Data compiled by: Henry M. Rosenstock, Keith Draxl, Bruce W. Steiner, and John T. Herron

Ionization energy determinations

IE (eV) Method Reference
12. ± 1.EIGrimley, Burns, et al., 1960

References

Grimley, Burns, et al., 1960
Grimley, R.T.; Burns, R.P.; Inghram, M.G., Mass spectrometric study of the osmium-oxygen system, J. Chem. Phys., 1960, 33, 308. [all data]