Tantalum dioxide

Gas phase thermochemistry data

Quantity Value Units Method Reference Comment
Δfgas-200.83kJ/molReviewChase, 1998Data last reviewed in December, 1973
Quantity Value Units Method Reference Comment
gas,1 bar280.30J/mol*KReviewChase, 1998Data last reviewed in December, 1973

Gas Phase Heat Capacity (Shomate Equation)

Cp° = A + B*t + C*t2 + D*t3 + E/t2
H° − H°298.15= A*t + B*t2/2 + C*t3/3 + D*t4/4 − E/t + F − H
S° = A*ln(t) + B*t + C*t2/2 + D*t3/3 − E/(2*t2) + G
    Cp = heat capacity (J/mol*K)
    H° = standard enthalpy (kJ/mol)
    S° = standard entropy (J/mol*K)
    t = temperature (K) / 1000.

View plot Requires a JavaScript / HTML 5 canvas capable browser.

View table.

Temperature (K) 298. - 1200.1200. - 6000.
A 32.6473861.35459
B 57.91116-3.785257
C -49.871611.403637
D 15.20424-0.117692
E -0.169117-3.103420
F -213.2982-227.3586
G 303.6739343.3671
H -200.8320-200.8320
ReferenceChase, 1998Chase, 1998
Comment Data last reviewed in December, 1973 Data last reviewed in December, 1973

References

Chase, 1998
Chase, M.W., Jr., NIST-JANAF Themochemical Tables, Fourth Edition, J. Phys. Chem. Ref. Data, Monograph 9, 1998, 1-1951. [all data]