trinickel disulphide

Condensed phase thermochemistry data

Quantity Value Units Method Reference Comment
Δfliquid-34.400kcal/molReviewChase, 1998Data last reviewed in December, 1976
Quantity Value Units Method Reference Comment
liquid,1 bar51.601cal/mol*KReviewChase, 1998Data last reviewed in December, 1976
Quantity Value Units Method Reference Comment
Δfsolid-51.699kcal/molReviewChase, 1998Data last reviewed in December, 1976
Quantity Value Units Method Reference Comment
solid31.991cal/mol*KReviewChase, 1998Data last reviewed in December, 1976

Liquid Phase Heat Capacity (Shomate Equation)

Cp° = A + B*t + C*t2 + D*t3 + E/t2
H° − H°298.15= A*t + B*t2/2 + C*t3/3 + D*t4/4 − E/t + F − H
S° = A*ln(t) + B*t + C*t2/2 + D*t3/3 − E/(2*t2) + G
    Cp = heat capacity (cal/mol*K)
    H° = standard enthalpy (kcal/mol)
    S° = standard entropy (cal/mol*K)
    t = temperature (K) / 1000.

View plot Requires a JavaScript / HTML 5 canvas capable browser.

View table.

Temperature (K) 1062. - 3800.
A 45.84011
B 1.529370×10-9
C -5.900060×10-10
D 7.423750×10-11
E 3.008229×10-10
F -54.33810
G 93.85430
H -34.39921
ReferenceChase, 1998
Comment Data last reviewed in December, 1976

Solid Phase Heat Capacity (Shomate Equation)

Cp° = A + B*t + C*t2 + D*t3 + E/t2
H° − H°298.15= A*t + B*t2/2 + C*t3/3 + D*t4/4 − E/t + F − H
S° = A*ln(t) + B*t + C*t2/2 + D*t3/3 − E/(2*t2) + G
    Cp = heat capacity (cal/mol*K)
    H° = standard enthalpy (kcal/mol)
    S° = standard entropy (cal/mol*K)
    t = temperature (K) / 1000.

View plot Requires a JavaScript / HTML 5 canvas capable browser.

View table.

Temperature (K) 298. - 829.829. - 1062.
A 27.2934045.08009
B 10.56960-1.706521×10-7
C 1.6659611.106310×10-7
D -0.896689-2.502931×10-8
E -0.215957-1.180740×10-8
F -61.04749-58.25100
G 60.5892989.45559
H -51.70010-51.70010
ReferenceChase, 1998Chase, 1998
Comment Data last reviewed in December, 1976 Data last reviewed in December, 1976

References

Chase, 1998
Chase, M.W., Jr., NIST-JANAF Themochemical Tables, Fourth Edition, J. Phys. Chem. Ref. Data, Monograph 9, 1998, 1-1951. [all data]