nickel dioxide

Gas phase ion energetics data

Data compiled by: John E. Bartmess

Electron affinity determinations

EA (eV) Method Reference Comment
3.0430 ± 0.0050LPESRamond, Davico, et al., 2002
0.820 ± 0.030LPESWu and Wang, 1997Cluster ion: Ni..(O2)-.
3.050 ± 0.010LPESWu and Wang, 1997Linear ONiO isomer

References

Ramond, Davico, et al., 2002
Ramond, T.M.; Davico, G.E.; Hellberg, F.; Svedberg, F.; Salen, P.; Soderqvist, P.; Lineberger, W.C., Photoelectron spectroscopy of nickel, palladium, and platinum oxide anions, J. Molec. Spectros., 2002, 216, 1, 1-14, https://doi.org/10.1006/jmsp.2002.8669 . [all data]

Wu and Wang, 1997
Wu, H.; Wang, L.-S., A Study of Nickel Monoxide (NiO), Nickel Dioxide (NiO2) and Ni(O2) Complex by Anion Photoelectron Spectroscopy, J. Chem. Phys., 1997, 107, 1, 16, https://doi.org/10.1063/1.474362 . [all data]