Molybdenum sulfide

Condensed phase thermochemistry data

Quantity Value Units Method Reference Comment
Δfliquid-64.603kcal/molReviewChase, 1998Data last reviewed in June, 1978
Quantity Value Units Method Reference Comment
liquid,1 bar43.301cal/mol*KReviewChase, 1998Data last reviewed in June, 1978
Quantity Value Units Method Reference Comment
Δfsolid-97.299kcal/molReviewChase, 1998Data last reviewed in June, 1978
Quantity Value Units Method Reference Comment
solid27.481cal/mol*KReviewChase, 1998Data last reviewed in June, 1978

Liquid Phase Heat Capacity (Shomate Equation)

Cp° = A + B*t + C*t2 + D*t3 + E/t2
H° − H°298.15= A*t + B*t2/2 + C*t3/3 + D*t4/4 − E/t + F − H
S° = A*ln(t) + B*t + C*t2/2 + D*t3/3 − E/(2*t2) + G
    Cp = heat capacity (cal/mol*K)
    H° = standard enthalpy (kcal/mol)
    S° = standard entropy (cal/mol*K)
    t = temperature (K) / 1000.

View plot Requires a JavaScript / HTML 5 canvas capable browser.

View table.

Temperature (K) 2080. - 3500.
A 37.50000
B 1.822680×10-8
C -5.796521×10-9
D 6.366461×10-10
E 9.886650×10-9
F -81.29579
G 78.89881
H -64.60430
ReferenceChase, 1998
Comment Data last reviewed in June, 1978

Solid Phase Heat Capacity (Shomate Equation)

Cp° = A + B*t + C*t2 + D*t3 + E/t2
H° − H°298.15= A*t + B*t2/2 + C*t3/3 + D*t4/4 − E/t + F − H
S° = A*ln(t) + B*t + C*t2/2 + D*t3/3 − E/(2*t2) + G
    Cp = heat capacity (cal/mol*K)
    H° = standard enthalpy (kcal/mol)
    S° = standard entropy (cal/mol*K)
    t = temperature (K) / 1000.

View plot Requires a JavaScript / HTML 5 canvas capable browser.

View table.

Temperature (K) 298. - 2080.
A 26.36021
B 7.879699
C 0.000159
D -0.000025
E -0.230008
F -106.2810
G 55.73681
H -97.30010
ReferenceChase, 1998
Comment Data last reviewed in June, 1978

References

Chase, 1998
Chase, M.W., Jr., NIST-JANAF Themochemical Tables, Fourth Edition, J. Phys. Chem. Ref. Data, Monograph 9, 1998, 1-1951. [all data]