Iridium trioxide

Gas phase ion energetics data

Data compiled as indicated in comments:
RDSH - Henry M. Rosenstock, Keith Draxl, Bruce W. Steiner, and John T. Herron

Ionization energy determinations

IE (eV) Method Reference Comment
11.9EINorman, Staley, et al., 1965RDSH

References

Norman, Staley, et al., 1965
Norman, J.H.; Staley, H.G.; Bell, W.E., Massspectrometric study of gaseous oxides of iridium, J. Chem. Phys., 1965, 42, 1123. [all data]