Diindium monotelluride

Gas phase ion energetics data

Data compiled by: Henry M. Rosenstock, Keith Draxl, Bruce W. Steiner, and John T. Herron

Ionization energy determinations

IE (eV) Method Reference
7.1 ± 0.5EIColin and Drowart, 1968

Appearance energy determinations

Ion AE (eV) Other Products MethodReferenceComment
In+9.3 ± 1.0?EIColin and Drowart, 1968

References

Colin and Drowart, 1968
Colin, R.; Drowart, J., Mass spectrometric determination of dissociation energies of gaseous indium sulphides, selenides and tellurides, J. Chem. Soc. Faraday Trans., 1968, 64, 2611. [all data]