Methanimidamide, N'-(4-methoxyphenyl)-N,N-dimethyl-

Kovats' RI, non-polar column, isothermal

Data compiled by: NIST Mass Spectrometry Data Center, William E. Wallace, director

Column type PackedPacked
Active phase SE-30SE-30
Column length (m) 3.3.
Carrier gas N2N2
Substrate Chromosorb W AW (60-80 mesh)Chromosorb W AW
Column diameter (mm)
Phase thickness (μm)
Temperature (C) 240.240.
I 1636.1636.
ReferenceOsek, Oszczapowicz, et al., 1986Oszczapowicz, Osek, et al., 1984
Comment MSDC-RI MSDC-RI

References

Osek, Oszczapowicz, et al., 1986
Osek, J.; Oszczapowicz, J.; Drzewinski, W., Prediction of Retention Indices of N1,N1-Dialkylformamidines on a Non-Polar Column, J. Chromatogr., 1986, 351, 177-182, https://doi.org/10.1016/S0021-9673(01)83486-5 . [all data]

Oszczapowicz, Osek, et al., 1984
Oszczapowicz, J.; Osek, J.; Dolecka, E., Retention indices of dimethylformamidines, dimethylacetamidines and tetramethylguanidines on a non-polar column, J. Chromatogr., 1984, 315, 95-100, https://doi.org/10.1016/S0021-9673(01)90727-7 . [all data]