3,4,5-trichloro-2-(trichloromethyl)pyridine

Condensed phase thermochemistry data

Data compiled by: Hussein Y. Afeefy, Joel F. Liebman, and Stephen E. Stein

Quantity Value Units Method Reference Comment
Δfsolid-43.71kcal/molCcbKosorotov, Zemlyakova, et al., 1978
Quantity Value Units Method Reference Comment
Δcsolid-588.64kcal/molCcbKosorotov, Zemlyakova, et al., 1978

References

Kosorotov, Zemlyakova, et al., 1978
Kosorotov, V.I.; Zemlyakova, Z.F.; Platonov, V.A.; Ovchinnikov, V.G.; Simulin, Yu.N.; Dzhagatspanyan, R.V., Determination of thermal effects of the synthesis of chloropicolines and chloroaminopicolines, J. Appl. Chem. USSR (Engl. Transl.), 1978, 51, 2262-2263, In original 2376. [all data]