4-n-Pentanoyl-4-n'-butanoyloxyazobenzene

Phase change data

Data compiled by: Eugene S. Domalski and Elizabeth D. Hearing

Enthalpy of fusion

ΔfusH (kcal/mol) Temperature (K) Reference Comment
3.4020373.3Fanelli, Poeti, et al., 1988Solid-smectic 2.

Entropy of fusion

ΔfusS (cal/mol*K) Temperature (K) Reference Comment
9.111373.3Fanelli, Poeti, et al., 1988Solid-smectic

Enthalpy of phase transition

ΔHtrs (kcal/mol) Temperature (K) Initial Phase Final Phase Reference Comment
3.4039378.1liquidliquidFanelli, Poeti, et al., 1988
0.8141398.4liquidliquidFanelli, Poeti, et al., 1988
0.183404.7liquidliquidFanelli, Poeti, et al., 1988

Entropy of phase transition

ΔStrs (cal/mol*K) Temperature (K) Initial Phase Final Phase Reference Comment
9.003378.1liquid, Smectic 2liquid, smectic AFanelli, Poeti, et al., 1988
2.043398.4liquid, Smectic Aliquid, nematicFanelli, Poeti, et al., 1988
0.4520404.7liquid, Nematicliquid, isotropicFanelli, Poeti, et al., 1988

References

Fanelli, Poeti, et al., 1988
Fanelli, E.; Poeti, G.; Francescangeli, O.; Torguati, G., Mesomorphic behaviour of some 4-n-pentanoyl-4'-n-alkanoyloxy azobenzenes (PPAPE). A new series of liquid-crystal compounds, Il Nuovo Cimento, 1988, 10(11), 1373-1384. [all data]