thorium carbide

Gas phase ion energetics data

Data compiled by: Sharon G. Lias, Rhoda D. Levin, and Sherif A. Kafafi

Ionization energy determinations

IE (eV) Method Reference
7.9 ± 1.0EIGupta and Gingerich, 1980
8.0 ± 1.0EIKohl and Stearns, 1974

References

Gupta and Gingerich, 1980
Gupta, S.K.; Gingerich, K.A., A thermodynamic study of the gaseous thorium carbides, ThC, ThC2, ThC3, ThC4, ThC5, and ThC6, J. Chem. Phys., 1980, 72, 2795. [all data]

Kohl and Stearns, 1974
Kohl, F.J.; Stearns, C.A., Vaporization and dissociation energies of the molecular carbides of titanium, zirconium, hafnium, and thorium, High Temp. Sci., 1974, 6, 284. [all data]