Diberyllium monoxide

Gas phase ion energetics data

Data compiled as indicated in comments:
RDSH - Henry M. Rosenstock, Keith Draxl, Bruce W. Steiner, and John T. Herron

Ionization energy determinations

IE (eV) Method Reference Comment
10.5 ± 0.5EITheard and Hildenbrand, 1964RDSH

References

Theard and Hildenbrand, 1964
Theard, L.P.; Hildenbrand, D.L., Heat of formation of Be2O(g) by mass spectrometry, J. Chem. Phys., 1964, 41, 3416. [all data]