C8H4F5NO

Reaction thermochemistry data

Data compiled by: John E. Bartmess

Individual Reactions

C8H3F5NO- + Hydrogen cation = C8H4F5NO

By formula: C8H3F5NO- + H+ = C8H4F5NO

Quantity Value Units Method Reference Comment
Δr1364. ± 8.4kJ/molIMREKoppel, Koppel, et al., 1998gas phase

Gas phase ion energetics data

Data compiled by: John E. Bartmess

De-protonation reactions

C8H3F5NO- + Hydrogen cation = C8H4F5NO

By formula: C8H3F5NO- + H+ = C8H4F5NO

Quantity Value Units Method Reference Comment
Δr1364. ± 8.4kJ/molIMREKoppel, Koppel, et al., 1998gas phase

References

Koppel, Koppel, et al., 1998
Koppel, I.; Koppel, J.; Maria, P.C.; Gal, J.F.; Notario, R.; Vlasov, V.M.; Taft, R.W., Comparison of Bronsted acidities of neutral NH-acids in gas phase, dimethyl sulfoxide and water, Int. J. Mass Spectrom., 1998, 175, 1-2, 61-69, https://doi.org/10.1016/S0168-1176(98)00113-X . [all data]