Iron dihydride, tetracarbonyl-

Gas phase thermochemistry data

Data compiled by: José A. Martinho Simões

Quantity Value Units Method Reference Comment
Δfgas-131.kcal/molReviewMartinho Simões

Reaction thermochemistry data

Data compiled by: José A. Martinho Simões

Individual Reactions

C4H2FeO4 (g) = 2Hydrogen atom (g) + C4FeO4 (g)

By formula: C4H2FeO4 (g) = 2H (g) + C4FeO4 (g)

Quantity Value Units Method Reference Comment
Δr130.kcal/molESTMiller and Beauchamp, 1991Please also see Martinho Simões and Beauchamp, 1990. The reaction enthalpy was estimated from the activation enthalpy for thermal decomposition in solution, 26. ± 2. kcal/mol Pearson and Mauermann, 1982, yielding Fe(CO)4 and H2, and from the activation enthalpy of the oxidative addition of H2 to Fe(CO)4 in a rare gas matrix, ca. 0. kcal/mol Sweany, 1981, yielding Fe(CO)4H2. The enthalpy of formation relies on -105.1 ± 3.4 kcal/mol for the enthalpy of formation of Fe(CO)4(g)

Gas phase ion energetics data

Data compiled by: Sharon G. Lias, Rhoda D. Levin, and Sherif A. Kafafi

Ionization energy determinations

IE (eV) Method Reference
9.65PEGuest, Higginson, et al., 1975

References

Martinho Simões
Martinho Simões, J.A., Private communication (see http://webbook.nist.gov/chemistry/om/). [all data]

Miller and Beauchamp, 1991
Miller, A.E.S.; Beauchamp, J.L., J. Am. Chem. Soc., 1991, 113, 8765. [all data]

Martinho Simões and Beauchamp, 1990
Martinho Simões, J.A.; Beauchamp, J.L., Chem. Rev., 1990, 90, 629. [all data]

Pearson and Mauermann, 1982
Pearson, R.G.; Mauermann, H., J. Am. Chem. Soc., 1982, 104, 500. [all data]

Sweany, 1981
Sweany, R.L., J. Am. Chem. Soc., 1981, 103, 2410. [all data]

Guest, Higginson, et al., 1975
Guest, M.F.; Higginson, B.R.; Lloyd, D.R.; Hillier, I.H., Interpretation of the valence photoelectron spectra of Mn(CO)5H, Mn(CO)5CH3 and Fe(CO)4H2, J. Chem. Soc. Faraday Trans. 2, 1975, 71, 902. [all data]