2,5-Dimethoxyethylbenzene
- Formula: C10H14O2
- Molecular weight: 166.2170
- IUPAC Standard InChIKey: CCZCWRYUYQRBPE-UHFFFAOYSA-N
- CAS Registry Number: 1199-08-2
- Chemical structure:

Normal alkane RI, polar column, temperature ramp

Column type | Active phase | I | Reference | Comment |
---|---|---|---|---|
Capillary | AT-Wax | 1861. | Kiss, Csoka, et al., 2011 | 60. m/0.25 mm/0.25 μm, Helium, 4. K/min; Tstart: 60. C; Tend: 280. C |

References

Kiss, Csoka, et al., 2011
Kiss, M.; Csoka, M.; Gyorfi, J.; Korany, K.,
Comparison of the fragrance constituents of Tuber aestivium and Tuber Brumale gathered in Hungary,
J. Appl. Botany Food Quality, 2011, 84, 102-110. [all data]