4-Isopropylcyclohexa-1,3-dienecarbaldehyde

Kovats' RI, non-polar column, temperature ramp

View large format table.

Column type Active phase I Reference Comment
CapillaryDB-51282.Lucero, Fredrickson, et al., 200630. m/0.25 mm/0.25 μm, He, 3. K/min; Tstart: 60. C
CapillarySPB-11248.Behera, Nagarajan, et al., 200430. m/0.32 mm/0.25 μm, He, 50. C @ 2. min, 2. K/min, 250. C @ 5. min

Van Den Dool and Kratz RI, non-polar column, temperature ramp

View large format table.

Column type Active phase I Reference Comment
CapillaryCP-Sil PONA GB1261.Cunicao, Lopes, et al., 2007100. m/0.25 mm/0.25 μm, He, 140. C @ 10. min, 5. K/min, 230. C @ 25. min
CapillaryRTX-11258.Cozzani, Muselli, et al., 200560. m/0.22 mm/0.25 μm, 2. K/min, 220. C @ 20. min; Tstart: 60. C
CapillaryHP-5MS1282.Pino, Mesa, et al., 200530. m/0.25 mm/0.25 μm, He, 60. C @ 2. min, 4. K/min, 250. C @ 20. min
CapillaryCP Sil 5 CB1246.Pino, Marbot, et al., 200225. m/0.25 mm/0.25 μm, N2, 60. C @ 6. min, 4. K/min; Tend: 280. C
CapillaryHP-51280.Couladis, Tsortanidou, et al., 200130. m/0.25 mm/0.25 μm, He, 3. K/min; Tstart: 60. C; Tend: 380. C

Van Den Dool and Kratz RI, non-polar column, custom temperature program

View large format table.

Column type Active phase I Reference Comment
CapillaryHP-5MS1286.3Andriamaharavo, 201430. m/0.25 mm/0.25 μm, He; Program: 60C (1 min) => 5 C/min => 210C => 10 C/min => 280C (15 min)
CapillaryHP-5MS1288.5Andriamaharavo, 201430. m/0.25 mm/0.25 μm, He; Program: 60C (1 min) => 5 C/min => 210C => 10 C/min => 280C (15 min)
CapillaryBPX-51282.Cardeal, da Silva, et al., 200630. m/0.25 mm/0.25 μm; Program: 35C(5min) => 3C/min => 210C => 40C/min => 240C (4min)
Capillary5 % Phenyl methyl siloxane1285.Sacchetti, Maietti, et al., 200530. m/0.32 mm/0.15 μm, He; Program: 45C => 1C/min => 100C => 5C/min => 250C (10min)

Van Den Dool and Kratz RI, polar column, temperature ramp

View large format table.

Column type Active phase I Reference Comment
CapillaryRTX-Wax1768.Cozzani, Muselli, et al., 200560. m/0.22 mm/0.25 μm, 2. K/min, 220. C @ 20. min; Tstart: 60. C

Normal alkane RI, non-polar column, temperature ramp

View large format table.

Column type Active phase I Reference Comment
CapillaryOptima-51289.Al-Qudah, Muhaidat, et al., 201230. m/0.25 mm/0.25 μm, Helium, 60. C @ 1. min, 3. K/min; Tend: 246. C
CapillaryRTX-11257.Bendiabdellah, El Amine Dib, et al., 201260. m/0.22 mm/0.25 μm, Helium, 2. K/min, 230. C @ 5. min; Tstart: 60. C
CapillaryHP-5 MS1290.Radulovic, Dordevic, et al., 201030. m/0.25 mm/0.25 μm, Helium, 5. K/min, 290. C @ 10. min; Tstart: 70. C
CapillaryDB-51282.Pino, Marbot, et al., 200630. m/0.25 mm/0.25 μm, Hydrogen, 70. C @ 4. min, 4. K/min; Tend: 280. C
CapillaryDB-11254.Sonboli, Mirjalili, et al., 200660. m/0.25 mm/0.25 μm, Helium, 5. K/min, 250. C @ 10. min; Tstart: 60. C
CapillaryHP-51294.Wang, Yang, et al., 200630. m/0.25 mm/0.25 μm, He, 60. C @ 2. min, 10. K/min, 250. C @ 10. min
CapillaryDB-51282.Bos, Stojanova, et al., 200530. m/0.249 mm/0.25 μm, He, 3. K/min; Tstart: 60. C; Tend: 290. C
CapillaryDB-51282.Sefidkon, Jamzad, et al., 200430. m/0.25 mm/0.25 μm, 50. C @ 5. min, 3. K/min; Tend: 250. C
CapillaryDB-51279.Tellez, Khan, et al., 200430. m/0.25 mm/0.25 μm, He, 3. K/min; Tstart: 60. C; Tend: 240. C
CapillaryHP-51283.Mookdasanit, Tamura, et al., 2003Helium, 2. K/min, 210. C @ 60. min; Column length: 30. m; Column diameter: 0.32 mm; Tstart: 70. C
CapillaryDB-11268.Eikani, Goodarznia, et al., 199960. m/0.25 mm/0.25 μm, He, 4. K/min; Tstart: 50. C; Tend: 230. C

Normal alkane RI, non-polar column, custom temperature program

View large format table.

Column type Active phase I Reference Comment
CapillaryRTX-11256.Bendiabdellah, El Amine Dib, et al., 201260. m/0.22 mm/0.25 μm, Helium; Program: not specified
CapillaryHP-5 MS1281.Payo, Colo, et al., 2011Program: not specified
CapillaryHP-5 MS1282.Payo, Colo, et al., 2011Program: not specified
CapillaryHP-51283.Riahi, Pourbasheer, et al., 2009Column length: 30. m; Column diameter: 0.32 mm; Program: not specified
CapillaryDB-51285.Nivinsliene, Butkiene, et al., 200750. m/0.32 mm/0.25 μm, Helium; Program: 60 0C (1 min) 5 0C/min -> 160 0C 10 0C/min -> 250 0C
CapillarySE-521285.Tognolini, Barocelli, et al., 200630. m/0.32 mm/0.15 μm, He; Program: 45C => 1C/min => 100C => 5C/min => 250C (10min)
CapillarySE-301276.Vinogradov, 2004Program: not specified
CapillaryCP Sil 5 CB1256.Weyerstahl, Marschall, et al., 1999Column length: 25. m; Column diameter: 0.39 mm; Program: not specified
CapillarySE-541293.Blank, Fischer, et al., 198930. m/0.32 mm/0.3 μm, He; Program: 35C(2min) => 40C/min => 50C(2min) => 6C/min => 230C(10min)

Normal alkane RI, polar column, temperature ramp

View large format table.

Column type Active phase I Reference Comment
CapillaryRTX-Wax1763.Bendiabdellah, El Amine Dib, et al., 201260. m/0.22 mm/0.25 μm, Helium, 2. K/min, 230. C @ 5. min; Tstart: 60. C
CapillaryInnowax1811.Suleimenov, Atazharova, et al., 2003He, 60. C @ 10. min, 4. K/min, 220. C @ 10. min; Column length: 60. m; Column diameter: 0.25 mm

Normal alkane RI, polar column, custom temperature program

View large format table.

Column type Active phase I Reference Comment
CapillaryHP Innowax FSP1811.Tabanca N., Demirci B., et al., 200760. m/0.25 mm/0.25 μm, N2; Program: 60C(10min) => 4C/min => 220C(10min) => 1C/min => 240C
CapillaryHP-Innowax FSC1811.Suleimenov Y.M., Atazhanova G.A., et al., 200660. m/0.25 mm/0.25 μm, He; Program: 60(10min) => 4C/min => 220C(10min) => 1C/min => 240C
CapillaryHP-Innowax1814.Piasenzotto, Gracco, et al., 200330. m/0.32 mm/0.5 μm, He; Program: 50C(4min) => 10C/min => 230C(10min) => 10C/min => 250C
CapillaryInnowax1811.Tunaher, Kirimer, et al., 200360. m/0.25 mm/0.25 μm, He; Program: 60C(10min) => 4C/min => 220C(10min) => 1C/min => 240C (20min)
CapillaryInnowax1811.Özcan, Akgül, et al., 200160. m/0.25 mm/0.25 μm, He; Program: 60C(10min) => 4C/min => 200C(10min) => 1C/min => 240C
CapillaryInnowax FSC1811.Kirimer, Tabanca, et al., 200060. m/0.25 mm/0.25 μm, He; Program: 60C(10 min) => 4C/min => 220C(10min) => 1C/min => 240C
CapillaryInnowax1815.Baser, Kürkcüoglu, et al., 199860. m/0.25 mm/0.25 μm; Program: 60C(10min) => 4C/min => 220C(10min) => 1C/min => 240C

References

Lucero, Fredrickson, et al., 2006
Lucero, M.E.; Fredrickson, E.L.; Estell, R.E.; Morrison, A.A.; Richman, D.B., Volatile Composition of Gutierrezia sarothrae (Broom Snakeweed) as Determined by Steam Distillation and Solid Phase Microextraction, J. Essent. Oil Res., 2006, 18, 2, 121-125, https://doi.org/10.1080/10412905.2006.9699039 . [all data]

Behera, Nagarajan, et al., 2004
Behera, S.; Nagarajan, S.; Rao, L.J.M., Microwave heating and conventional roasting of cumin seeds (Cuminum cyminum L.) and effect on chemical composition of volatiles, Food Chem., 2004, 87, 1, 25-29, https://doi.org/10.1016/j.foodchem.2003.10.012 . [all data]

Cunicao, Lopes, et al., 2007
Cunicao, M.M.; Lopes, A.R.; Côcco, L.C.; Yamamoto, C.I.; Plocharski, R.C.B.; Miguel, M.D.; Junior, A.G.; Auer, C.G.; Miguel, O.G., Phytochemical and antibacterial evaluation of essential oils from Ottonia Martiana Miq. (Piperaceae), J. Braz. Chem. Soc., 2007, 18, 1, 184-188, https://doi.org/10.1590/S0103-50532007000100021 . [all data]

Cozzani, Muselli, et al., 2005
Cozzani, S.; Muselli, A.; Desjobert, J.-M.; Bernardini, A.-F.; Tomi, F.; Casanova, J., Chemical composition of essential oil of Teucrium polium subsp. capitatum (L.) from Corsica, Flavour Fragr. J., 2005, 20, 4, 436-441, https://doi.org/10.1002/ffj.1463 . [all data]

Pino, Mesa, et al., 2005
Pino, J.A.; Mesa, J.; Muñoz, Y.; Martí, M.P.; Marbot, R., Volatile components from mango (Mangifera indica L.) cultivars, J. Agric. Food Chem., 2005, 53, 6, 2213-2223, https://doi.org/10.1021/jf0402633 . [all data]

Pino, Marbot, et al., 2002
Pino, J.A.; Marbot, R.; Quert, R.; García, H., Study of essential oils of Eucalyptus resinifera Smith, E. tereticornis Smith and Corymbia maculata (Hook.) K.D. Hill L.A.S. Johnson, grown in Cuba, Flavour Fragr. J., 2002, 17, 1, 1-4, https://doi.org/10.1002/ffj.1026 . [all data]

Couladis, Tsortanidou, et al., 2001
Couladis, M.; Tsortanidou, V.; Francisco-Ortega, J.; Santos-Guerra, A.; Harvala, C., Composition of the essential oils of Argyranthemum species growing in the Canary Islands, Flavour Fragr. J., 2001, 16, 2, 103-106, https://doi.org/10.1002/ffj.954 . [all data]

Andriamaharavo, 2014
Andriamaharavo, N.R., Retention Data. NIST Mass Spectrometry Data Center., NIST Mass Spectrometry Data Center, 2014. [all data]

Cardeal, da Silva, et al., 2006
Cardeal, Z.L.; da Silva, M.D.R.G.; Marriott, P.J., Comprehensive two-dimensional gas chromatography/mass spectrometric analysis of pepper volatiles, Rapid Commun. Mass Spectrom., 2006, 20, 19, 2823-2836, https://doi.org/10.1002/rcm.2665 . [all data]

Sacchetti, Maietti, et al., 2005
Sacchetti, G.; Maietti, S.; Muzzoli, M.; Scaglianti, M.; Manfredini, S.; Radice, M.; Bruni, R., Comparative evaluation of 11 essential oils of different origin as functional antioxidants, antiradicals and antimicrobials in foods, Food Chem., 2005, 91, 4, 621-632, https://doi.org/10.1016/j.foodchem.2004.06.031 . [all data]

Al-Qudah, Muhaidat, et al., 2012
Al-Qudah, M.A.; Muhaidat, R.; Trawenh, I.N.; Jaber, H.I.; Abu Zarga, M.H.; Abu Orabi, S.T., Volatile constituents of leaves and bulbs of Gynandriris Sisyrinchicum and their antimicrobial activities, Jordan J. Chem., 2012, 7, 3, 287-295. [all data]

Bendiabdellah, El Amine Dib, et al., 2012
Bendiabdellah, A.; El Amine Dib, M.; Djabou, N.; Allali, H.; Tabti, B.; Costa, J.; Myseli, A., Biological activities and volatile cinstituents of Daucus muricatus L. from Algeria, Chem. Centr. J., 2012, 6, 48, 1-22. [all data]

Radulovic, Dordevic, et al., 2010
Radulovic, N.; Dordevic, N.; Markovic, M.; Palic, R., Volatile constituents of Glechoma Hirsuta Waldst. Kit. and G. Hederacea L. (Lamiaceae), Bull. Chem. Soc. Ethiop., 2010, 24, 1, 67-76, https://doi.org/10.4314/bcse.v24i1.52962 . [all data]

Pino, Marbot, et al., 2006
Pino, J.A.; Marbot, R.; Payo, A.; Chao, D.; Herrera, P., Aromatic Plants from Western Cuba VII. Composition of the Leaf Oil of Psidium wrightii KRug et Urb., Lantana involucrata L., Cinnamonum montanum (Sw.) Berchtold et J. Persl. and Caesalpinia violacea (Mill.) Standley, J. Essent. Oil. Res., 2006, 18, 2, 170-174, https://doi.org/10.1080/10412905.2006.9699058 . [all data]

Sonboli, Mirjalili, et al., 2006
Sonboli, A.; Mirjalili, M.H.; Yousefzadi, M., Antimicrobial activity and composition of the essential oil of Cymbopogon Olivieri (Boiss.) Bor from Iran, Iranian J. Pharm. Res., 2006, 1, 65-68. [all data]

Wang, Yang, et al., 2006
Wang, Q.; Yang, Y.; Zhao, X.; Zhu, B.; Nan, P.; Zhao, J.; Wang, L.; Chen, F.; Liu, Z.; Zhong, Y., Chemical variation in the essential oil of Ephedra sinica from Northeastern China, Food Chem., 2006, 98, 1, 52-58, https://doi.org/10.1016/j.foodchem.2005.04.033 . [all data]

Bos, Stojanova, et al., 2005
Bos, R.; Stojanova, A.; Woerdenbag, H.J.; Koulman, A.; Quax, W.J., Volatile components of the aerial parts of Artemisia pontica L. grown in Bulgaria, Flavour Fragr. J., 2005, 20, 2, 145-148, https://doi.org/10.1002/ffj.1399 . [all data]

Sefidkon, Jamzad, et al., 2004
Sefidkon, F.; Jamzad, Z.; Mirza, M., Chemical variation in the essential oil of Satureja sahendica from Iran, Food Chem., 2004, 88, 3, 325-328, https://doi.org/10.1016/j.foodchem.2003.12.044 . [all data]

Tellez, Khan, et al., 2004
Tellez, M.R.; Khan, I.A.; Schaneberg, B.T.; Crockett, S.L.; Rimando, A.M.; Kobaisy, M., Steam distillation-solid-phase microextraction for the detection of Ephedra sinica in herbal preparations, J. Chromatogr. A, 2004, 1025, 1, 51-56, https://doi.org/10.1016/S0021-9673(03)01035-5 . [all data]

Mookdasanit, Tamura, et al., 2003
Mookdasanit, J.; Tamura, H.; Yoshizawa T.; Tokunaga T.; Nakanishi, K., Trace Volatile Compounds in Essential Oil of Citrus Sudachi by Means of Modified Solvent Extraction Method, Food Sci Technol. Res., 2003, 9, 1, 54-61, https://doi.org/10.3136/fstr.9.54 . [all data]

Eikani, Goodarznia, et al., 1999
Eikani, M.H.; Goodarznia, I.; Mirza, M., Supercritical carbon dioxide extraction of cumin seeds (Cuminum cyminum L.), Flavour Fragr. J., 1999, 14, 1, 29-31, https://doi.org/10.1002/(SICI)1099-1026(199901/02)14:1<29::AID-FFJ765>3.0.CO;2-G . [all data]

Payo, Colo, et al., 2011
Payo, D.A.; Colo, J.; Calumpong, H.; de Clerck, O., Variability of non-polar secondary metabolites in the Red Alga Portieria, Mar Drugs, 2011, 9, 11, 2438-2468, https://doi.org/10.3390/md9112438 . [all data]

Riahi, Pourbasheer, et al., 2009
Riahi, S.; Pourbasheer, E.; Ganjali, M.R.; Norouzi, P., Investigation of different linear and non-linear chemometric methods for modeling of retention index of essential oil components: Concerns to support vector mashine, J. Hazard. Mat., 2009, 166, 2-3, 853-859, https://doi.org/10.1016/j.jhazmat.2008.11.097 . [all data]

Nivinsliene, Butkiene, et al., 2007
Nivinsliene, O.; Butkiene, R.; Gudalevic, A.; Mockute, D.; Meskauskiene, V.; Grigaliunaite, B., Influence of urban environment on chemical composition of Tilia cordata essential oil, Chemija, 2007, 18, 1, 44-49. [all data]

Tognolini, Barocelli, et al., 2006
Tognolini, M.; Barocelli, E.; Ballabeni, V.; Bruni, R.; Bianchi, A.; Chiavarini, M.; Impicciatore, M., Comparative screening of plant essential oils: Phenylpropanoid moiety as basic core for antiplatelet activity, Life Sciences, 2006, 78, 13, 1419-1432, https://doi.org/10.1016/j.lfs.2005.07.020 . [all data]

Vinogradov, 2004
Vinogradov, B.A., Production, composition, properties and application of essential oils, 2004, retrieved from http://viness.narod.ru. [all data]

Weyerstahl, Marschall, et al., 1999
Weyerstahl, P.; Marschall, H.; Splittgerber, U.; Son, P.T.; Giang, P.M.; Kaul, V.K., Constituents of the essential oil from the fruits of Zanthoxylum rhetsoides Drake from Vietnam and from the aerial parts of Zanthoxylum alatum Roxb. from India, Flavour Fragr. J., 1999, 14, 4, 225-229, https://doi.org/10.1002/(SICI)1099-1026(199907/08)14:4<225::AID-FFJ818>3.0.CO;2-1 . [all data]

Blank, Fischer, et al., 1989
Blank, I.; Fischer, K.-H.; Grosch, W., Intensive neutral odourants of linden honey, Z. Lebensm. Unters. Forsch., 1989, 189, 5, 426-433, https://doi.org/10.1007/BF01028316 . [all data]

Suleimenov, Atazharova, et al., 2003
Suleimenov, E.M.; Atazharova, G.A.; Demirchi, B.; Baser, K.H.C.; Adekenov, S.M., Essential oil composition of Artemisia Lercheana and A. Sieversiana of Kazakhstan flora in Recent problems of development of new medicines of natural origin, Proceedings of symposium, St.Petersburg - Pushkin, 2003, 382-385. [all data]

Tabanca N., Demirci B., et al., 2007
Tabanca N.; Demirci B.; Crockett S.L.; Baser K.H.C.; Wedge D.E., Chemical composition and antifungal activity of Arnica longifolia, Aster hesperius, and Chrysothamnus nauseosus essential oils, J. Agric. Food Chem., 2007, 55, 21, 8430-8435, https://doi.org/10.1021/jf071379c . [all data]

Suleimenov Y.M., Atazhanova G.A., et al., 2006
Suleimenov Y.M.; Atazhanova G.A.; Ozek T.; Demirci B.; Kulyyasov A.T.; Adekenov S.M.; Baser K.H.C., Essential oil composition of three species of Achillea from Kazakhstan, Chem. Nat. Compd. (Engl. Transl.), 2006, 37, 5, 447-450, https://doi.org/10.1023/A:1014471326724 . [all data]

Piasenzotto, Gracco, et al., 2003
Piasenzotto, L.; Gracco, L.; Conte, L., Solid phase microextraction (SPME) applied to honey quality control, J. Sci. Food Agric., 2003, 83, 10, 1037-1044, https://doi.org/10.1002/jsfa.1502 . [all data]

Tunaher, Kirimer, et al., 2003
Tunaher, Z.; Kirimer, N.; Baser, K.H.C., Wood essential oils of Juniperus foetidissima Willd., Holzforschung, 2003, 57, 140-144. [all data]

Özcan, Akgül, et al., 2001
Özcan, M.; Akgül, A.; Bascr, K.H.C.; Özck, T.; Tabanca, N., Essential oil composition of sea fennel (Crithmum maritimum) form Turkey, Nahrung/Food, 2001, 45, 5, 353-356, https://doi.org/10.1002/1521-3803(20011001)45:5<353::AID-FOOD353>3.0.CO;2-4 . [all data]

Kirimer, Tabanca, et al., 2000
Kirimer, N.; Tabanca, N.; Özek, T.; Tümen, G.; Baser, K.H.C., Essential oils of annual Sideritis species growing in Turkey, Pharm. Biol., 2000, 38, 2, 106-111, https://doi.org/10.1076/1388-0209(200004)3821-1FT106 . [all data]

Baser, Kürkcüoglu, et al., 1998
Baser, K.H.C.; Kürkcüoglu, M.; Aytac, Z., Composition of the essential oil of Salvia euphratica Montbret ex Bentham var. euphratica from Turkey, Flavour Fragr. J., 1998, 13, 1, 63-64, https://doi.org/10.1002/(SICI)1099-1026(199801/02)13:1<63::AID-FFJ694>3.0.CO;2-Z . [all data]