trans-Carveol

Van Den Dool and Kratz RI, non-polar column, temperature ramp

Data compiled by: NIST Mass Spectrometry Data Center, William E. Wallace, director

Column type CapillaryCapillaryCapillaryCapillaryCapillary
Active phase HP-5MSCP-Sil PONA GBBP-1DB-5HP-5MS
Column length (m) 30.100.50.30.30.
Carrier gas HeHeHeHeHe
Substrate
Column diameter (mm) 0.250.250.220.250.25
Phase thickness (μm) 0.250.250.250.250.25
Tstart (C) 60.140.60.60.60.
Tend (C) 250.230.220.240.280.
Heat rate (K/min) 2.5.2.3.3.
Initial hold (min) 8.10.
Final hold (min) 30.25.20.
I 1216.1206.1195.1217.1217.
ReferenceBenkaci-Ali, Baaliouamer, et al., 2007Cunicao, Lopes, et al., 2007Duquesnoy, Castola, et al., 2007Flamini, Cioni, et al., 2007Kundakovic, Fokialakis, et al., 2007
Comment MSDC-RI MSDC-RI MSDC-RI MSDC-RI MSDC-RI
Column type CapillaryCapillaryCapillaryCapillaryCapillary
Active phase RTX-1HP-5MSDB-5HP-5MSDB-5
Column length (m) 60.30.30.30.30.
Carrier gas HeHeHeHeHe
Substrate
Column diameter (mm) 0.220.250.250.250.25
Phase thickness (μm) 0.250.250.250.250.25
Tstart (C) 60.60.50.80.60.
Tend (C) 230.280.250.300.240.
Heat rate (K/min) 2.3.3.4.3.
Initial hold (min)     2.
Final hold (min) 30. 10.
I 1196.1220.1218.1233.91218.
ReferenceMuselli, Rossi, et al., 2007Vagionas, Ngassapa, et al., 2007Yu, Liao, et al., 2007Zeng, Zhao, et al., 2007Batista-Pereira, Fernandes, et al., 2006
Comment MSDC-RI MSDC-RI MSDC-RI MSDC-RI MSDC-RI
Column type CapillaryCapillaryCapillaryCapillaryCapillary
Active phase BP-1BP-1DB-55 % Phenyl methyl siloxaneDB-5
Column length (m) 50.50.30.25.30.
Carrier gas HeHe HeN2
Substrate
Column diameter (mm) 0.220.250.250.250.32
Phase thickness (μm) 0.250.251.0.250.25
Tstart (C) 60.60.50.60.60.
Tend (C) 220.220.290.280.240.
Heat rate (K/min) 2.2.10.3.3.
Initial hold (min)   1. 3.
Final hold (min) 20.20.10.20.5.
I 1192.1197.1261.1217.1210.
ReferenceBoti, Bighelli, et al., 2006Bousmaha, Boti, et al., 2006Bylaite and Meyer, 2006Djarri, Medjroubi, et al., 2006Dob, Dahmane, et al., 2006
Comment MSDC-RI MSDC-RI MSDC-RI MSDC-RI MSDC-RI
Column type CapillaryCapillaryCapillaryCapillaryCapillary
Active phase DB-5BP-1DB-1SPB-1HP-5MS
Column length (m) 50.50.25.30.30.
Carrier gas N2He HeHe
Substrate
Column diameter (mm) 0.20.220.20.20.25
Phase thickness (μm) 0.320.250.330.20.25
Tstart (C) 60.60.50.70.60.
Tend (C) 220.220.300.220.280.
Heat rate (K/min) 5.2.4.3.4.
Initial hold (min) 3.   5.
Final hold (min) 5.20. 15.
I 1217.1198.1207.1195.1219.
ReferenceEsmaeili, Nematollahi, et al., 2006Gonny, Cavaleiro, et al., 2006Osorio, Alarcon, et al., 2006Salgueiro L.R., Pinto E., et al., 2006Saroglou, Dorizas, et al., 2006
Comment MSDC-RI MSDC-RI MSDC-RI MSDC-RI MSDC-RI
Column type CapillaryCapillaryCapillaryCapillaryCapillary
Active phase HP-5MSDB-5HP-5RTX-1HP-5
Column length (m) 30.30.30.60.30.
Carrier gas H2H2N2 He
Substrate
Column diameter (mm) 0.250.250.250.220.25
Phase thickness (μm) 0.250.250.250.250.25
Tstart (C) 50.35.60.60.60.
Tend (C) 285.270.220.220.260.
Heat rate (K/min) 4.35.5.2.3.
Initial hold (min)   10.
Final hold (min)  20. 20.
I 1212.1217.1219.1199.1220.
ReferenceVujisic L., Vuckovic I., et al., 2006Alves, Pinto, et al., 2005Cioni, Flamini, et al., 2005Cozzani, Muselli, et al., 2005Javidnia, Miri, et al., 2005
Comment MSDC-RI MSDC-RI MSDC-RI MSDC-RI MSDC-RI
Column type CapillaryCapillaryCapillaryCapillaryCapillary
Active phase DB-1HP-5MSHP-5MSHP-5MSSE-54
Column length (m) 30.30.30.30.30.
Carrier gas N2HeHeHeHe
Substrate
Column diameter (mm) 0.250.250.250.250.25
Phase thickness (μm) 0.250.250.250.250.25
Tstart (C) 50.80.80.80.60.
Tend (C) 200.290.290.290.260.
Heat rate (K/min) 5.2.4.6.2.
Initial hold (min)     5.
Final hold (min)
I 1204.1230.11232.41233.41215.
ReferenceTchoumbougnang, Zollo, et al., 2005Zhao, Liang, et al., 2005Zhao, Liang, et al., 2005Zhao, Liang, et al., 2005Alma, Nitz, et al., 2004
Comment MSDC-RI MSDC-RI MSDC-RI MSDC-RI MSDC-RI
Column type CapillaryCapillaryCapillaryCapillaryCapillary
Active phase SPB-1SPB-1HP-5HP-1DB-5
Column length (m) 30.30.30.25.30.
Carrier gas HeHe HeN2
Substrate
Column diameter (mm) 0.250.20.250.320.25
Phase thickness (μm) 0.250.20.250.170.25
Tstart (C) 70.70.60.50.60.
Tend (C) 220.220.220.200.240.
Heat rate (K/min) 3.3.5.3.3.
Initial hold (min)   10.
Final hold (min) 15.15.
I 1192.1196.1219.1180.1219.
ReferenceAntunes, Sevinate-Pinto, et al., 2004Cavaleiro, Salgueiro, et al., 2004Ceccarini, Macchia, et al., 2004Fernández-Ocaña, Gómez-Rodríguez, et al., 2004Flamini, Cioni, et al., 2004
Comment MSDC-RI MSDC-RI MSDC-RI MSDC-RI MSDC-RI
Column type CapillaryCapillaryCapillaryCapillaryCapillary
Active phase BP-1HP-5HP-5DB-5HP-5MS
Column length (m) 50.30.30.30.30.
Carrier gas  HeHeHeHe
Substrate
Column diameter (mm) 0.220.250.250.250.25
Phase thickness (μm) 0.250.25 0.250.25
Tstart (C) 60.60.60.60.60.
Tend (C) 220.260.260.260.280.
Heat rate (K/min) 2.3.3.3.4.
Initial hold (min)     5.
Final hold (min) 20.
I 1197.1218.1218.1217.1217.
ReferenceGonny, Bradesi, et al., 2004Javidnia, Miri, et al., 2004Javidnia, Miri, et al., 2004, 2Javidnia, Miri, et al., 2004, 3Karioti, Hadjipavlou-Litina, et al., 2004
Comment MSDC-RI MSDC-RI MSDC-RI MSDC-RI MSDC-RI
Column type CapillaryCapillaryCapillaryCapillaryCapillary
Active phase DB-5MSBP-1Optima 5DB-5DB-5
Column length (m) 30.30.25.25.30.
Carrier gas HeN2HeN2He
Substrate
Column diameter (mm) 0.250.320.250.250.25
Phase thickness (μm) 0.250.250.250.250.25
Tstart (C) 40.60.60.75.60.
Tend (C) 280.220.280.210.240.
Heat rate (K/min) 4.5.3.3.3.
Initial hold (min) 2.  10.
Final hold (min)  13.20.1.
I 1221.1196.1215.1222.1220.
ReferenceMardarowicz, Wianowska, et al., 2004Raina, Kumar, et al., 2004Vérité, Nacer, et al., 2004bin Ahmad and bin Jantan, 2003Bader, Flamini, et al., 2003
Comment MSDC-RI MSDC-RI MSDC-RI MSDC-RI MSDC-RI
Column type CapillaryCapillaryCapillaryCapillaryCapillary
Active phase OV-1DB-5HP-5HP-5MSHP-5
Column length (m) 25.30.30.60.30.
Carrier gas H2 HeHeHe
Substrate
Column diameter (mm) 0.250.320.250.250.25
Phase thickness (μm) 0.30.50.250.250.25
Tstart (C) 50.40.60.40.60.
Tend (C) 200.265.280.310.240.
Heat rate (K/min) 3.7.4.3.3.
Initial hold (min) 1. 5.1.
Final hold (min) 20.5. 20.
I 1192.1229.1217.1224.1219.
ReferenceBicchi, Rubiolo, et al., 2003Högnadóttir and Rouseff, 2003Karioti, Skaltsa, et al., 2003Lalel, Singh, et al., 2003Macchioni, Cioni, et al., 2003
Comment MSDC-RI MSDC-RI MSDC-RI MSDC-RI MSDC-RI
Column type CapillaryCapillaryCapillaryCapillaryCapillary
Active phase HP-5HP-5HP-5HP-5DB-5
Column length (m) 30.30.30.30.30.
Carrier gas HeHeHeHeHe
Substrate
Column diameter (mm) 0.250.250.250.250.25
Phase thickness (μm) 0.250.250.250.250.25
Tstart (C) 60.60.60.60.60.
Tend (C) 280.280.280.280.260.
Heat rate (K/min) 4.3.3.3.4.
Initial hold (min) 5.
Final hold (min)
I 1217.1217.1217.1218.1217.
ReferenceSkaltsa, Demetzos, et al., 2003Tsiri, Kretsi, et al., 2003Tsiri, Kretsi, et al., 2003Tzakou, Couladis, et al., 2003Javidnia, Miri, et al., 2002
Comment MSDC-RI MSDC-RI MSDC-RI MSDC-RI MSDC-RI
Column type CapillaryCapillaryCapillaryCapillaryCapillary
Active phase HP-1CP Sil 5 CBCP Sil 5 CBDB-1HP-5
Column length (m) 24.25.30.50.30.
Carrier gas HeN2H2HeHe
Substrate
Column diameter (mm) 0.320.250.250.220.25
Phase thickness (μm) 0.170.250.250.250.25
Tstart (C) 60.60.60.60.60.
Tend (C) 250.280.280.220.380.
Heat rate (K/min) 4.4.2.2.3.
Initial hold (min) 2.6.10.
Final hold (min) 20. 40.20.
I 1194.1192.1192.1198.1211.
ReferenceNath, Sarma, et al., 2002Pino, Marbot, et al., 2002Pino, Marbot, et al., 2002, 2Pintore, Usai, et al., 2002Couladis, Tsortanidou, et al., 2001
Comment MSDC-RI MSDC-RI MSDC-RI MSDC-RI MSDC-RI
Column type CapillaryCapillaryCapillaryCapillaryCapillary
Active phase HP-5MSCP Sil 5 CBBP-1HP-5MSHP-101
Column length (m) 30.50.50.30.25.
Carrier gas HeHe HeHe
Substrate
Column diameter (mm) 0.250.320.220.250.2
Phase thickness (μm) 0.250.40.250.250.2
Tstart (C) 60.60.60.60.70.
Tend (C) 280.280.220.280.200.
Heat rate (K/min) 3.3.2.4.3.
Initial hold (min) 5.10. 5.2.
Final hold (min)  60.20. 10.
I 1217.1196.1207.1217.1220.
ReferenceGiamakis, Kretsi, et al., 2001Pino and Marbot, 2001Rezzi, Cavaleiro, et al., 2001Skaltsa, Mavrommati, et al., 2001Milos and Radonic, 2000
Comment MSDC-RI MSDC-RI MSDC-RI MSDC-RI MSDC-RI
Column type CapillaryCapillaryCapillaryCapillaryCapillary
Active phase HP-5HP-5Mega 5MSBP-1DB-1
Column length (m) 30.30.30.50.30.
Carrier gas HeHeHeHe
Substrate
Column diameter (mm) 0.250.250.250.220.25
Phase thickness (μm) 0.250.250.250.250.25
Tstart (C) 50.70.40.60.50.
Tend (C) 280.230.240.220.220.
Heat rate (K/min) 4.2.3.2.3.
Initial hold (min) 5. 2. 3.
Final hold (min)    20.
I 1215.1214.1209.1195.1208.
ReferenceSkaltsa, Lazari, et al., 2000Song, Sawamura, et al., 2000Verzera, Trozzi, et al., 2000Mazzoni, Tomi, et al., 1999Muselli, Hoi, et al., 1999
Comment MSDC-RI MSDC-RI MSDC-RI MSDC-RI MSDC-RI
Column type CapillaryCapillaryCapillaryCapillaryCapillary
Active phase Methyl SiliconeCP Sil 5 CBOV-1BP-1OV-101
Column length (m) 50.25.25.50.50.
Carrier gas N2He HeN2
Substrate
Column diameter (mm) 0.250.250.250.220.25
Phase thickness (μm) 0.17 0.30.25
Tstart (C) 80.60.50.60.80.
Tend (C) 200.260.200.230.200.
Heat rate (K/min) 2.5.3.2.2.
Initial hold (min)   1.
Final hold (min)   20.35.
I 1209.1200.1192.1197.1211.
ReferenceSumathykutty, Rao, et al., 1999Weyerstahl, Marschall, et al., 1999Bicchi, Rubiolo, et al., 1998Mariotti, Tomi, et al., 1997Yang, Sugisawa, et al., 1992
Comment MSDC-RI MSDC-RI MSDC-RI MSDC-RI MSDC-RI
Column type CapillaryCapillary
Active phase OV-101HP-1
Column length (m) 50.50.
Carrier gas N2He
Substrate
Column diameter (mm) 0.250.32
Phase thickness (μm)  1.05
Tstart (C) 80.40.
Tend (C) 200.230.
Heat rate (K/min) 2.2.
Initial hold (min)
Final hold (min)  40.
I 1211.1204.
ReferenceYang, Sugisawa, et al., 1992Tang, Zhang, et al., 1990
Comment MSDC-RI MSDC-RI

Normal alkane RI, polar column, custom temperature program

Data compiled by: NIST Mass Spectrometry Data Center, William E. Wallace, director

Column type CapillaryCapillaryCapillaryCapillaryCapillary
Active phase HP-InnowaxHP InnowaxHP InnowaxInnowax FSCInnowax FSC
Column length (m) 60.30.60.60.60.
Carrier gas HeliumNitrogen HeliumHelium
Substrate
Column diameter (mm) 0.250.250.250.250.25
Phase thickness (μm) 0.250.250.330.250.25
Program not specified35 0C (10 min) 3 0C/min -> 205 0C 10 0C/min -> 225 0Cnot specified60 0C (10 min) 4 0C/min -> 220 0C (10 min) 1 0C/min -> 240 0C60 0C (10 min) 4 0C/min -> 220 0C (10 min) 1 0C/min -> 240 0C
I 1836.1841.1845.1845.1845.
ReferenceFeng, Cui, et al., 2011Laribi, Kouki, et al., 2011Noorizadeh and Farmany, 2010Polatoglu, Demirci, et al., 2010Baser, Demirci, et al., 2009
Comment MSDC-RI MSDC-RI MSDC-RI MSDC-RI MSDC-RI
Column type CapillaryCapillaryCapillaryCapillaryCapillary
Active phase HP InnowaxDB-WaxHP-Innowax FSCInnowax FSCHP-Innowax FSC
Column length (m) 50.30.60.60.60.
Carrier gas HeliumHydrogenN2N2He
Substrate
Column diameter (mm) 0.200.320.250.250.25
Phase thickness (μm) 0.250.500.250.250.25
Program 40 0C (5 min) 2 0C/min -> 270 0C -> 260 0C (20 min)60 0C (3 min) 2 0C/min -> 220 0C 3 0C/min -> 245 0C (20 min)60C(10min) => 4C/min => 220C(10min) => 1C/min => 240C60C(10min) => 4C/min => 220C(10min) => 1C/min => 240C60(10min) => 4C/min => 220C(10min) => 1C/min => 240C
I 1845.1828.1845.1845.1845.
ReferenceMancini, Arnold, et al., 2009Selli, 2007Demirci B., Baser K.H.C., et al., 2006Iscan, Kirimer, et al., 2006Suleimenov Y.M., Atazhanova G.A., et al., 2006
Comment MSDC-RI MSDC-RI MSDC-RI MSDC-RI MSDC-RI
Column type CapillaryCapillaryCapillaryCapillaryCapillary
Active phase HP-Innowax FSCDB-WaxHP-Innowax FSCInnowax FSCHP-Innowax FSC
Column length (m) 60.30.60.60.60.
Carrier gas N2HeN2HeHe
Substrate
Column diameter (mm) 0.250.250.250.250.25
Phase thickness (μm) 0.250.250.250.250.25
Program 60C(10min) => 4C/min => 220C => (10min) => 1C/min => 240Cnot specified60C(10min) => 4C/min => 220C (10min) => 1C/min => 240C60C(10min) => 4C/min => 220C(10min) => 1C/min => 240C60C(10min) => 4C/min => 220C(10min) => 1C/min => 240C
I 1845.1801.1845.1845.1845.
ReferenceTabanca, Demirci, et al., 2006Berlinet, Ducruet, et al., 2005Demirci, Demirci, et al., 2005Kosar, Özek, et al., 2005Sezik E., Kocakulak E., et al., 2005
Comment MSDC-RI MSDC-RI MSDC-RI MSDC-RI MSDC-RI
Column type CapillaryCapillaryCapillaryCapillaryCapillary
Active phase HP-Innowax FSCHP-Innowax FSCInnowax FSCHP-Innowax FSCHP-Innowax FSC
Column length (m) 60.60.60.60.60.
Carrier gas HeHeHeHeHe
Substrate
Column diameter (mm) 0.250.250.250.250.25
Phase thickness (μm) 0.250.250.250.250.25
Program 60C(10min) => 4C/min => 220C(10min) => 1C/min => 240C60C(10min) => 4C/min => 220C(10min) => 1C/min => 240C60C(10min) => 4C/min => 220C(10min) => 1C/min => 240C60C(10min) => 4C/min => 220C(10min) => 1C/min => 240C60C(10min) => 4C/min => 220C(10min) => 1C/min => 240C
I 1845.1845.1845.1845.1845.
ReferenceTabanca, Demirci, et al., 2005Viljoen, Subramoney, et al., 2005Baser, Özek, et al., 2004Demirci, Paper, et al., 2004Kivcak, Akay, et al., 2004
Comment MSDC-RI MSDC-RI MSDC-RI MSDC-RI MSDC-RI
Column type CapillaryCapillaryCapillaryCapillaryCapillary
Active phase HP-InnowaxCarbowax 20MInnowax FSCHP-Innowax FSCHP-Innowax FSC
Column length (m) 50. 60.60.60.
Carrier gas   HeHeN2
Substrate
Column diameter (mm) 0.2 0.250.250.25
Phase thickness (μm) 0.2 0.250.250.25
Program not specifiednot specified60C(10min) => 4C/min => 220C (10min) => 1C/min => 240C60C (10min) => 4C/min => 220C (10min) => 1C/min => 240C60C(10min) => 4C/min => 220C(10min) => 1C/min => 240C
I 1845.1845.1845.1845.1845.
ReferenceSenatore, Apostolides Arnold, et al., 2004Vinogradov, 2004Baser, Demirci, et al., 2003Demirci, Baser, et al., 2003Kaya, Demirci, et al., 2003
Comment MSDC-RI MSDC-RI MSDC-RI MSDC-RI MSDC-RI
Column type CapillaryCapillaryCapillaryCapillaryCapillary
Active phase HP-Innowax FSCHP-InnowaxHP-InnowaxInnowax FSCInnowax
Column length (m) 60.60.60.60.60.
Carrier gas He HeHeHe
Substrate
Column diameter (mm) 0.250.250.250.250.25
Phase thickness (μm) 0.250.250.250.250.25
Program 60C(10min) => 4C/min => 220C(10min) => 1C/min => 240C(40min)60C(10min) => 4C/min => 220C(10min) => 1C/min => 240C60 0C (10 min) 4 K/min -> 220 0C (10 min) 1 K/min -> 240 0C60C(10min) => 4C/min => 220C(10min) => 1C/min => 240C60C(10min) => 4C/min => 220C(10min) => 1C/min => 240C
I 1845.1845.1845.1845.1845.
ReferenceKürkcüoglu, Demirci, et al., 2003Viljoen, van Vuuren, et al., 2003Baser, Demirci, et al., 2002Baser, Demirei, et al., 2002Baser, Nuriddinov, et al., 2002
Comment MSDC-RI MSDC-RI MSDC-RI MSDC-RI MSDC-RI
Column type CapillaryCapillaryCapillaryCapillaryCapillary
Active phase HP-InnowaxHP-Innowax FSCInnowax FSCHP-InnowaxHP-Innowax
Column length (m) 60.60.60.60.60.
Carrier gas HeN2 HeHe
Substrate
Column diameter (mm) 0.250.250.250.250.25
Phase thickness (μm) 0.250.250.250.250.25
Program 60 0C (10 min) 4 K/min -> 220 0C (10 min) 1 K/min -> 240 0C60C(10min) => 4C/min => 220C(10min) => 1C/min => 240C60C(10min) => 4C/min => 220C(10min) => 1C/min => 240C60 0C (10 min) 10 K/min -> 220 0C (10 min) 1K/min -> 240 0C60 0C (10 min) 4 K/min -> 220 0C (10 min) 1 K/min -> 240 0C
I 1845.1845.1845.1845.1845.
ReferenceDemirci, Baser, et al., 2002Hüsnü Can Baser, Demirci, et al., 2002Tunalier, Kirimer, et al., 2002Baser, Demirci, et al., 2001Gören, Demirci, et al., 2001
Comment MSDC-RI MSDC-RI MSDC-RI MSDC-RI MSDC-RI
Column type CapillaryCapillaryCapillaryCapillaryCapillary
Active phase HP-Innowax FSCInnowaxHP-InnowaxInnowaxInnowax FSC
Column length (m) 60.60.60.60.60.
Carrier gas HeHeHeHeHelium
Substrate
Column diameter (mm) 0.250.250.250.250.25
Phase thickness (μm) 0.250.250.250.250.25
Program 60C(10min) => 4C/min => 220C(10min) => 1C/min => 240C60C(10min) => 4C/min => 200C(10min) => 1C/min => 240C60C(10min) => 4C/min => 220C(10min) => 1C/min => 240C60 0C (10 min) 4 K/min -> 220 0C (10 min) 1 K/min -> 240 0C60 0C (10 min) 4 0C/min -> 220 0C (10 min) 1 0C/min -> 240 0C
I 1845.1845.1845.1845.1845.
ReferenceKirimer N., Tabanea N., et al., 2001Özcan, Akgül, et al., 2001Tabanca, Kirimer, et al., 2001Baser, Özek, et al., 2000Kirimer, Tabanca, et al., 1999
Comment MSDC-RI MSDC-RI MSDC-RI MSDC-RI MSDC-RI
Column type CapillaryCapillaryCapillary
Active phase InnowaxDB-WaxDB-Wax
Column length (m) 60.60.60.
Carrier gas  N2N2
Substrate
Column diameter (mm) 0.25
Phase thickness (μm) 0.250.250.25
Program 60C(10min) => 4C/min => 220C(10min) => 1C/min => 240Cnot specifiednot specified
I 1845.1843.1843.
ReferenceBaser, Kürkcüoglu, et al., 1998Weyerstahl, Marschall, et al., 1998Weyerstahl, Marschall, et al., 1998, 2
Comment MSDC-RI MSDC-RI MSDC-RI

Normal alkane RI, polar column, temperature ramp

Data compiled by: NIST Mass Spectrometry Data Center, William E. Wallace, director

Column type CapillaryCapillaryCapillaryCapillaryCapillary
Active phase HP-InnowaxSupelcowax-10InnowaxHP-InnowaxCarbowax
Column length (m) 60.30.30.30.60.
Carrier gas HeliumHeliumHeliumN2He
Substrate
Column diameter (mm) 0.250.200.250.250.2
Phase thickness (μm) 0.250.200.250.250.25
Tstart (C) 60.70.40.50.60.
Tend (C) 220.220.250.240.250.
Heat rate (K/min) 5.3.6.5.2.
Initial hold (min) 1. 1.1.8.
Final hold (min) 5.15.4.4.15.
I 1832.1830.1878.1836.1828.
ReferenceFeng, Cui, et al., 2011Neves, Rosa, et al., 2010Seo, Kim, et al., 2009Cheraif, Ben Jannet, et al., 2007Ferhat, Tigrine-Kordjani, et al., 2007
Comment MSDC-RI MSDC-RI MSDC-RI MSDC-RI MSDC-RI
Column type CapillaryCapillaryCapillaryCapillaryCapillary
Active phase Supelcowax-10Supelcowax-10DB-WaxBP-20Supelcowax 10
Column length (m) 30.30.30.50.30.
Carrier gas HeHeHeliumHeHelium
Substrate
Column diameter (mm) 0.250.250.250.220.20
Phase thickness (μm) 0.250.250.250.250.20
Tstart (C) 50.40.40.60.70.
Tend (C) 250.250.250.220.220.
Heat rate (K/min) 2.3.3.2.3.
Initial hold (min)  5.
Final hold (min)  10.20.20.15.
I 1828.1825.1801.1829.1830.
ReferenceRaal, Orav, et al., 2007Vichi, Riu-Aumatell, et al., 2007Berlinet, Brat, et al., 2006Boti, Muselli, et al., 2006Cavaleiro, Pinto, et al., 2006
Comment MSDC-RI MSDC-RI MSDC-RI MSDC-RI MSDC-RI
Column type CapillaryCapillaryCapillaryCapillaryCapillary
Active phase DB-WaxHP-WaxHP-20MDB-WaxDB-Wax
Column length (m) 60.30.30.30.60.
Carrier gas  NitrogenN2HeN2
Substrate
Column diameter (mm) 0.250.250.250.250.25
Phase thickness (μm) 0.250.250.250.250.25
Tstart (C) 70.50.50.50.70.
Tend (C) 230.280.250.180.230.
Heat rate (K/min) 2.5.5.3.2.
Initial hold (min) 2.   2.
Final hold (min) 20.5.10.40.20.
I 1832.1825.1825.1833.1873.
ReferenceLan Phi N.T., Nishiyama C., et al., 2006Marzouk, Mansour, et al., 2006Marzouk, Neffati, et al., 2006Lee, Umano, et al., 2005Njoroge, Koaze, et al., 2005
Comment MSDC-RI MSDC-RI MSDC-RI MSDC-RI MSDC-RI
Column type CapillaryCapillaryCapillaryCapillaryCapillary
Active phase DB-WaxSupelcowax-10DB-WaxDB-WaxDB-Wax
Column length (m) 60.30.30.60.60.
Carrier gas N2 HeN2He
Substrate
Column diameter (mm) 0.250.250.250.250.25
Phase thickness (μm) 0.250.250.250.25
Tstart (C) 70.40.90.70.60.
Tend (C) 230.220.220.230.220.
Heat rate (K/min) 2.3.7.2.2.
Initial hold (min) 2.5.2.2.4.
Final hold (min) 20.10.5.20.
I 1873.1825.1853.1874.1834.
ReferenceNjoroge, Koaze, et al., 2005, 2Vichi, Riu-Aumatell, et al., 2005Agnihotri, Thappa, et al., 2004Choi, 2004Jiang and Kubota, 2004
Comment MSDC-RI MSDC-RI MSDC-RI MSDC-RI MSDC-RI
Column type CapillaryCapillaryCapillaryCapillaryCapillary
Active phase Innowax FSCDB-WaxDB-WaxDB-WaxDB-Wax
Column length (m) 60.60.60.60.60.
Carrier gas Helium NitrogenHeliumN2
Substrate
Column diameter (mm) 0.250.250.250.250.25
Phase thickness (μm)  0.250.25 0.25
Tstart (C) 60.70.70.70.70.
Tend (C) 220.230.230.210.230.
Heat rate (K/min) 4.2.2.2.2.
Initial hold (min) 10.2.2.
Final hold (min)  20. 60.
I 1845.1879.1879.1841.1857.
ReferenceLourens, Reddy, et al., 2004Sawamura, Son, et al., 2004Sawamura, Sou, et al., 2004Mookdasanit, Tamura, et al., 2003Tu, Thanh, et al., 2002
Comment MSDC-RI MSDC-RI MSDC-RI MSDC-RI MSDC-RI
Column type CapillaryCapillaryCapillaryCapillaryCapillary
Active phase DB-WaxDB-WaxDB-WaxHP Innowax FSPInnowax
Column length (m) 60.60.60.60.60.
Carrier gas HeNitrogenHeHeHe
Substrate
Column diameter (mm) 0.250.250.250.250.25
Phase thickness (μm) 0.25 0.250.250.25
Tstart (C) 40.40.40.60.60.
Tend (C) 200.200.200.220.220.
Heat rate (K/min) 2.2.2.
Initial hold (min) 2.10.2.10.10.
Final hold (min)    10.
I 1825.1845.1833.1845.1845.
ReferenceUmano, Hagi, et al., 2002Tamura, Boonbumrung, et al., 2000Umano, Hagi, et al., 2000Kaya, Baser, et al., 1999Kaya, Baser, et al., 1999, 2
Comment MSDC-RI MSDC-RI MSDC-RI MSDC-RI MSDC-RI
Column type CapillaryCapillaryCapillaryCapillaryCapillary
Active phase HP-InnowaxBP-20DB-WaxHP-Innowax FSCBP-20
Column length (m) 60.25.30.60.25.
Carrier gas HeH2N2HeH2
Substrate
Column diameter (mm) 0.250.330.250.250.33
Phase thickness (μm) 0.250.50.250.250.5
Tstart (C) 60.80.45.60.80.
Tend (C) 220.220.220.220.220.
Heat rate (K/min)  5.3.4.5.
Initial hold (min) 10.  10.
Final hold (min)    10.
I 1845.1850.1849.1845.1850.
ReferenceKaya, Baser, et al., 1999, 3Bignell, Dunlop, et al., 1998Mölleken, Sinnwell, et al., 1998Tümen, Baser, et al., 1998Bignell, Dunlop, et al., 1997
Comment MSDC-RI MSDC-RI MSDC-RI MSDC-RI MSDC-RI
Column type CapillaryCapillaryCapillaryCapillaryCapillary
Active phase BP-20BP-20BP-20BP-20BP-20
Column length (m) 25.25.25.25.25.
Carrier gas H2H2H2 H2
Substrate
Column diameter (mm) 0.330.330.330.330.33
Phase thickness (μm) 0.50.50.50.50.5
Tstart (C) 80.80.80.80.80.
Tend (C) 220.220.220.220.220.
Heat rate (K/min) 5.5.5.5.5.
Initial hold (min)
Final hold (min)
I 1850.1850.1850.1850.1850.
ReferenceBignell, Dunlop, et al., 1997, 2Bignell, Dunlop, et al., 1997, 3Bignell, Dunlop, et al., 1997, 4Bignell, Dunlop, et al., 1997, 5Bignell, Dunlop, et al., 1997, 6
Comment MSDC-RI MSDC-RI MSDC-RI MSDC-RI MSDC-RI
Column type Capillary
Active phase Carbowax 20M
Column length (m) 45.
Carrier gas Hydrogen
Substrate
Column diameter (mm) 0.32
Phase thickness (μm) 1.0
Tstart (C) 60.
Tend (C) 200.
Heat rate (K/min) 2.
Initial hold (min) 5.
Final hold (min)
I 1829.
ReferenceKollmannsberger, Nitz, et al., 1992
Comment MSDC-RI

Kovats' RI, non-polar column, isothermal

Data compiled by: NIST Mass Spectrometry Data Center, William E. Wallace, director

Column type Capillary
Active phase SE-30
Column length (m) 40.
Carrier gas
Substrate
Column diameter (mm) 0.35
Phase thickness (μm) 0.35
Temperature (C) 100.
I 1202.6
ReferenceTudor, 1997
Comment MSDC-RI

Kovats' RI, non-polar column, temperature ramp

Data compiled by: NIST Mass Spectrometry Data Center, William E. Wallace, director

Column type CapillaryCapillaryCapillaryCapillaryCapillary
Active phase DB-5MSDB-5DB-5DB-5HP-5MS
Column length (m) 30.30.30.30.30.
Carrier gas HeHeHeHeHe
Substrate
Column diameter (mm) 0.250.250.260.260.25
Phase thickness (μm) 0.250.250.250.250.25
Tstart (C) 60.60.60.60.50.
Tend (C) 180. 246.246.250.
Heat rate (K/min) 3.3.3.3.3.
Initial hold (min)     10.
Final hold (min) 15.   5.
I 1219.1219.1217.1217.1217.
ReferenceAngioni, Barra, et al., 2006Lucero, Fredrickson, et al., 2006Adams, Morris, et al., 2005Adams and Nguyen, 2005Asuming, Beauchamp, et al., 2005
Comment MSDC-RI MSDC-RI MSDC-RI MSDC-RI MSDC-RI
Column type CapillaryCapillaryCapillaryCapillaryCapillary
Active phase DB-5MSCP Sil 8 CBDB-5HP-5MSSE-30
Column length (m) 30.30.50.30.30.
Carrier gas HeH2HeHeHe
Substrate
Column diameter (mm) 0.250.250.320.250.25
Phase thickness (μm) 0.250.250.250.25
Tstart (C) 60.50.50.60.60.
Tend (C) 240.220.280.280.240.
Heat rate (K/min) 3.3.5.3.4.
Initial hold (min)  2.2.
Final hold (min)   10.
I 1220.1218.1218.1201.1188.
ReferenceMaia, Andrade, et al., 2005Schwob, Bessiere, et al., 2004Baranauskiene, Venskutonis, et al., 2003Gkinis, Tzakou, et al., 2003Juliani, Koroch, et al., 2002
Comment MSDC-RI MSDC-RI MSDC-RI MSDC-RI MSDC-RI
Column type CapillaryCapillaryCapillaryCapillaryCapillary
Active phase CP Sil 5 CBHP-5MSBP-1HP-5SE-54
Column length (m) 25.30.30.30.30.
Carrier gas HeHeN2HeHe
Substrate
Column diameter (mm) 0.250.250.320.250.26
Phase thickness (μm)  0.250.250.250.25
Tstart (C) 50.50.60.60.60.
Tend (C) 230.250.220.280.246.
Heat rate (K/min) 3.3.5.3.3.
Initial hold (min)
Final hold (min)   13.
I 1197.1217.1196.1215.1217.
ReferenceKasali, Adio, et al., 2002Salido, Altarejos, et al., 2002Shawl, Srivastava, et al., 2002Tzakou and Couladis, 2001Adams, 2000
Comment MSDC-RI MSDC-RI MSDC-RI MSDC-RI MSDC-RI
Column type CapillaryCapillaryCapillaryCapillaryCapillary
Active phase DB-5SE-54DB-5DB-5DB-5
Column length (m) 30.30.30.30.30.
Carrier gas He He He
Substrate
Column diameter (mm) 0.260.260.260.320.26
Phase thickness (μm) 0.250.250.25 0.25
Tstart (C) 60.60.60.50.60.
Tend (C) 240.246.246.250.246.
Heat rate (K/min) 3.3.3.3.3.
Initial hold (min)    5.
Final hold (min)
I 1217.1217.1217.1223.1217.
ReferenceAdams, 2000, 2Adams, 2000, 3Adams, 2000, 4Tzakou, Harvala, et al., 2000Adams, 1999
Comment MSDC-RI MSDC-RI MSDC-RI MSDC-RI MSDC-RI
Column type CapillaryCapillaryCapillaryCapillary
Active phase Methyl SiliconeDB-5OV-1DB-5
Column length (m) 30.30.30.30.
Carrier gas HeHeHe
Substrate
Column diameter (mm) 0.320.250.31
Phase thickness (μm) 0.250.253.
Tstart (C) 60.60.70.40.
Tend (C) 250.240.280.210.
Heat rate (K/min) 2.3.10.2.
Initial hold (min) 2.  2.
Final hold (min) 5.  120.
I 1199.1217.1215.1214.
ReferenceAdegoke, Rao, et al., 1998Tellez, Estell, et al., 1997Afsharypuor, Asgary, et al., 1996Loayza, Abujder, et al., 1995
Comment MSDC-RI MSDC-RI MSDC-RI MSDC-RI

Kovats' RI, non-polar column, custom temperature program

Data compiled by: NIST Mass Spectrometry Data Center, William E. Wallace, director

Column type CapillaryCapillaryCapillaryCapillaryCapillary
Active phase HP-5MSDB-5MSBP-1AT-5DB-5
Column length (m) 30.30.25.60.30.
Carrier gas HeHeN2He
Substrate
Column diameter (mm) 0.250.250.250.250.26
Phase thickness (μm) 0.250.250.250.250.25
Program 50C(2min) => 2C/min => 160C(5min) => 50C/min => 270C (6min)60C(5min) => 2C/min => 140C= 5C/min => 250C(5min)60C => 5C/min => 220C(5min) => 3C/min => 245C(5min)60 C (1 min) 4 K/min -> 200 C 10 K/min -> 280 Cnot specified
I 1217.1207.1197.1217.1217.
ReferenceMevy, Bousquet-Melou, et al., 2006Tuberoso, Kowalczyk, et al., 2005Dwivedi, Khan, et al., 2004Rojas and Usubillaga, 2000Adams, 1998
Comment MSDC-RI MSDC-RI MSDC-RI MSDC-RI MSDC-RI
Column type CapillaryCapillary
Active phase DB-5DB-5
Column length (m) 30.30.
Carrier gas  He
Substrate
Column diameter (mm) 0.250.25
Phase thickness (μm) 0.250.25
Program 50C(5min) => 2C/min => 250C (60min) => 2C/min => 270C => 1C/min => 290C40C => 2C/min => 60C => 4C/min => 240C
I 1181.1215.
ReferenceRoscigno, 1998Santos, Andrade, et al., 1998
Comment MSDC-RI MSDC-RI

References

Benkaci-Ali, Baaliouamer, et al., 2007
Benkaci-Ali, F.; Baaliouamer, A.; Meklati, B.Y.; Chemat, F., Chemical composition of seed essential oils from Algerian Nigella sativa extracted by microwave and hydrodistillation, Flavour Fragr. J., 2007, 22, 2, 148-153, https://doi.org/10.1002/ffj.1773 . [all data]

Cunicao, Lopes, et al., 2007
Cunicao, M.M.; Lopes, A.R.; Côcco, L.C.; Yamamoto, C.I.; Plocharski, R.C.B.; Miguel, M.D.; Junior, A.G.; Auer, C.G.; Miguel, O.G., Phytochemical and antibacterial evaluation of essential oils from Ottonia Martiana Miq. (Piperaceae), J. Braz. Chem. Soc., 2007, 18, 1, 184-188, https://doi.org/10.1590/S0103-50532007000100021 . [all data]

Duquesnoy, Castola, et al., 2007
Duquesnoy, E.; Castola, V.; Casanova, J., Composition and chemical variability of the twig oil of Abies alba Miller from Corsica, Flavour Fragr. J., 2007, 22, 4, 293-299, https://doi.org/10.1002/ffj.1796 . [all data]

Flamini, Cioni, et al., 2007
Flamini, G.; Cioni, P.L.; Morelli, I.; Bader, A., Essential oils of the aerial parts of three Salvia species from Jordan: Salvia lanigera, S. spinosa and S. syriaca, Food Chem., 2007, 100, 2, 732-735, https://doi.org/10.1016/j.foodchem.2005.10.032 . [all data]

Kundakovic, Fokialakis, et al., 2007
Kundakovic, T.; Fokialakis, N.; Kovacevic, N.; Chinou, I., Essential oil composition of Achillea lingulata and A. umbellata, Flavour Fragr. J., 2007, 22, 3, 184-187, https://doi.org/10.1002/ffj.1778 . [all data]

Muselli, Rossi, et al., 2007
Muselli, A.; Rossi, P.-G.; Desjobert, J.-M.; Bernardini, A.-F.; Berti, L.; Costa, J., Chemical composition and antibacterial activity of Otanthus maritimus (L.) Hoffmanns. Link essential oils from Corsica, Flavour Fragr. J., 2007, 22, 3, 217-223, https://doi.org/10.1002/ffj.1787 . [all data]

Vagionas, Ngassapa, et al., 2007
Vagionas, K.; Ngassapa, O.; Runyoro, D.; Graikou, K.; Gortzi, O.; Chinou, I., Chemical analysis of edible aromatic plants growing in Tanzania, Food Chem., 2007, 105, 4, 1711-1717, https://doi.org/10.1016/j.foodchem.2007.05.029 . [all data]

Yu, Liao, et al., 2007
Yu, J.Q.; Liao, Z.X.; Cai, X.Q.; Lei, J.C.; Zou, G.L., Composition, antimicrobial activity and cytotoxicity of essential oils from Aristolochia mollissima, Environmental Toxicology and Pharmacology, 2007, 23, 2, 162-167, https://doi.org/10.1016/j.etap.2006.08.004 . [all data]

Zeng, Zhao, et al., 2007
Zeng, Y.-X.; Zhao, C.-X.; Liang, Y.-Z.; Yang, H.; Fang, H.-Z.; Yi, L.-Z.; Zeng, Z.-D., Comparative analysis of volatile components from Clematis species growing in China, Anal. Chim. Acta., 2007, 595, 1-2, 328-339, https://doi.org/10.1016/j.aca.2006.12.022 . [all data]

Batista-Pereira, Fernandes, et al., 2006
Batista-Pereira, L.G.; Fernandes, J.B.; Correa, A.G.; da Silva, M.F.G.F.; Vieira, P.C., Electrophysiological responses of eucalyptus brown looper Thyrinteina arnobia to essential oils of seven Eucalyptus species, J. Braz. Chem. Soc., 2006, 17, 3, 555-561, https://doi.org/10.1590/S0103-50532006000300019 . [all data]

Boti, Bighelli, et al., 2006
Boti, J.B.; Bighelli, A.; Cavaleiro, C.; Salgueiro, L.; Casanova, J., Chemical variability of Juniperus oxycedrus ssp. oxycedrus berry and leaf oils from Corsica, analysed by combination of GC, GC-MS and 13C-NMR, Flavour Fragr. J., 2006, 21, 2, 268-273, https://doi.org/10.1002/ffj.1579 . [all data]

Bousmaha, Boti, et al., 2006
Bousmaha, L.; Boti, J.B.; Bekkara, F.A.; Castola, V.; Casanova, J., Infraspecific chemical variability of the essential oil of Lavandula dentata L. from Algeria, Flavour Fragr. J., 2006, 21, 2, 368-372, https://doi.org/10.1002/ffj.1659 . [all data]

Bylaite and Meyer, 2006
Bylaite, E.; Meyer, A.S., · Characterisation of volatile aroma compounds of orange juices by three dynamic and static headspace gas chromatography techniques, Eur. Food Res. Technol., 2006, 222, 1-2, 176-184, https://doi.org/10.1007/s00217-005-0141-8 . [all data]

Djarri, Medjroubi, et al., 2006
Djarri, L.; Medjroubi, K.; Akkal, S.; Elomri, A.; Seguin, E.; Vérité, P., Composition of the essential oil of aerial parts of an endemic species of the Apiaceae of Algeria, Daucus reboudii Coss., Flavour Fragr. J., 2006, 21, 4, 647-649, https://doi.org/10.1002/ffj.1636 . [all data]

Dob, Dahmane, et al., 2006
Dob, T.; Dahmane, D.; Chelghoum, C., Essential oil composition of Juniperus oxycedrus growing in Algeria, Pharm. Biol., 2006, 44, 1, 1-6, https://doi.org/10.1080/13880200500530922 . [all data]

Esmaeili, Nematollahi, et al., 2006
Esmaeili, A.; Nematollahi, F.; Rustaiyan, A.; Moazami, N.; Masoudi, S.; Bamasian, S., Volatile constituents of Achillea pachycephala, A. oxyodonta and A. biebersteinii from Iran, Flavour Fragr. J., 2006, 21, 2, 253-256, https://doi.org/10.1002/ffj.1571 . [all data]

Gonny, Cavaleiro, et al., 2006
Gonny, M.; Cavaleiro, C.; Salgueiro, L.; Casanova, J., Analysis of Juniperus communis subsp. alpina needle, berry, wood and root oils by combination of GC, GC/MS and 13C-NMR, Flavour Fragr. J., 2006, 21, 1, 99-106, https://doi.org/10.1002/ffj.1527 . [all data]

Osorio, Alarcon, et al., 2006
Osorio, C.; Alarcon, M.; Moreno, C.; Bonilla, A.; Barrios, J.; Garzon, C.; Duque, C., Characterization of Odor-Active Volatiles in Champa ( Campomanesia lineatifolia R. P.), J. Agric. Food Chem., 2006, 54, 2, 509-516, https://doi.org/10.1021/jf052098c . [all data]

Salgueiro L.R., Pinto E., et al., 2006
Salgueiro L.R.; Pinto E.; Goncalves M.J.; Costa I.; Palmeira A.; Cavaleiro C.; Pina-Vaz C.; Rodrigues A.G.; Martinez-De-Oliveira J., Antifungal activity of the essential oil of Thymus capitellatus against Candida, Aspergillus and dermatophyte strains, Flavour Fragr. J., 2006, 21, 5, 749-753, https://doi.org/10.1002/ffj.1610 . [all data]

Saroglou, Dorizas, et al., 2006
Saroglou, V.; Dorizas, N.; Kypriotakis, Z.; Skaltsa, H.D., Analysis of the essential oil composition of eight Anthemis species from Greece, J. Chromatogr. A, 2006, 1104, 1-2, 313-322, https://doi.org/10.1016/j.chroma.2005.11.087 . [all data]

Vujisic L., Vuckovic I., et al., 2006
Vujisic L.; Vuckovic I.; Tesevic V.; Dokovic D.; Ristic M.S.; Janackovic P.; Milosavljevic S., Comparative examination of the essential oils of Anthemis ruthenica and A-arvensis wild-growing in Serbia, Flavour Fragr. J., 2006, 21, 3, 458-461, https://doi.org/10.1002/ffj.1681 . [all data]

Alves, Pinto, et al., 2005
Alves, R.J.V.; Pinto, A.C.; da Costa, A.V.M.; Rezende, C.M., Zizyphus mauritiana Lam. (Rhamnaceae) and the chemical composition of its floral fecal odor, J. Braz. Chem. Soc., 2005, 16, 3B, 654-656, https://doi.org/10.1590/S0103-50532005000400027 . [all data]

Cioni, Flamini, et al., 2005
Cioni, P.L.; Flamini, G.; Caponi, C.; Ceccarini, L.; Morelli, I., Analysis of volatile fraction, fixed oil and tegumental waxes of the seeds of two different cultivars of Helianthus annuus, Food Chem., 2005, 90, 4, 713-717, https://doi.org/10.1016/j.foodchem.2004.04.031 . [all data]

Cozzani, Muselli, et al., 2005
Cozzani, S.; Muselli, A.; Desjobert, J.-M.; Bernardini, A.-F.; Tomi, F.; Casanova, J., Chemical composition of essential oil of Teucrium polium subsp. capitatum (L.) from Corsica, Flavour Fragr. J., 2005, 20, 4, 436-441, https://doi.org/10.1002/ffj.1463 . [all data]

Javidnia, Miri, et al., 2005
Javidnia, K.; Miri, R.; Kamalinejad, M.; Edraki, N., Chemical composition of Ferula persica Wild. essential oil from Iran, Flavour Fragr. J., 2005, 20, 6, 605-606, https://doi.org/10.1002/ffj.1496 . [all data]

Tchoumbougnang, Zollo, et al., 2005
Tchoumbougnang, F.; Zollo, P.H.A.; Boyom, F.F.; Nyegue, M.A.; Bessière, J.M.; Menut, C., Aromatic plants of tropical Central Africa. XLVIII. Comparative study of the essential oils of four Hyptis species from Cameroon: H. lanceolata Poit., H. pectinata (L.) Poit., H. spicigera Lam. and H. suaveolens Poit., Flavour Fragr. J., 2005, 20, 3, 340-343, https://doi.org/10.1002/ffj.1441 . [all data]

Zhao, Liang, et al., 2005
Zhao, C.-X.; Liang, Y.-Z.; Fang, H.-Z.; Li, X.-N., Temperature-programmed retention indices for gas chromatography-mass spectroscopy analysis of plant essential oils, J. Chromatogr. A, 2005, 1096, 1-2, 76-85, https://doi.org/10.1016/j.chroma.2005.09.067 . [all data]

Alma, Nitz, et al., 2004
Alma, M.H.; Nitz, S.; Kollmannsberger, H.; Digrak, M.; Efe, F.T.; Yilmaz, N., Chemical composition and antimicrobial activity of the essential oils from the gum of Turkish Pistachio (Pistacia vera L.), J. Agric. Food Chem., 2004, 52, 12, 3911-3914, https://doi.org/10.1021/jf040014e . [all data]

Antunes, Sevinate-Pinto, et al., 2004
Antunes, T.; Sevinate-Pinto, I.; Barroso, J.G.; Cavaleiro, C.; Salgueiro, L.R., Micromorphology of trichomes and composition of essential oil of Teucrium capitatum, Flavour Fragr. J., 2004, 19, 4, 336-340, https://doi.org/10.1002/ffj.1310 . [all data]

Cavaleiro, Salgueiro, et al., 2004
Cavaleiro, C.; Salgueiro, L.R.; Miguel, M.G.; da Cunha, A.P., Analysis by gas chromatography?mass spectrometry of the volatile components of Teucrium lusitanicum and Teucrium algarbiensis, J. Chromatogr. A, 2004, 1033, 1, 187-190, https://doi.org/10.1016/j.chroma.2004.01.005 . [all data]

Ceccarini, Macchia, et al., 2004
Ceccarini, L.; Macchia, M.; Flamini, G.; Cioni, P.L.; Caponi, C.; Morelli, I., Essential oil composition of Helianthus annuus L. leaves and heads of two cultivated hybride Carlos and Florom 350, Ind. Crops Prod., 2004, 19, 1, 13-17, https://doi.org/10.1016/S0926-6690(03)00076-1 . [all data]

Fernández-Ocaña, Gómez-Rodríguez, et al., 2004
Fernández-Ocaña, A.M.; Gómez-Rodríguez, M.V.; Velasco-Negueruela, A.; Camacho-Simarro, A.M.; Fernández-López, C.; Altarejos, J., In vivo antifungal activity of the essential oil of Bupleurum gibraltarium against plasmopara halstedii in sunflower, J. Agric. Food Chem., 2004, 52, 21, 6414-6417, https://doi.org/10.1021/jf040219n . [all data]

Flamini, Cioni, et al., 2004
Flamini, G.; Cioni, P.L.; Morelli, I.; Maccioni, S.; Baldini, R., Phytochemical typologies in some populations of Myrtus communis L. on Caprione Promontory (East Liguria, Italy), Food Chem., 2004, 85, 4, 599-604, https://doi.org/10.1016/j.foodchem.2003.08.005 . [all data]

Gonny, Bradesi, et al., 2004
Gonny, M.; Bradesi, P.; Casanova, J., Identification of the components of the essential oil from wild Corsican Daucus carota L. using 13C-NMR spectroscopy, Flavour Fragr. J., 2004, 19, 5, 424-433, https://doi.org/10.1002/ffj.1330 . [all data]

Javidnia, Miri, et al., 2004
Javidnia, K.; Miri, R.; Jafari, A.; Rezai, H., Analysis of the volatile constituents of Nepeta macrosiphon Boiss. grown in Iran, Flavour Fragr. J., 2004, 19, 2, 156-158, https://doi.org/10.1002/ffj.1287 . [all data]

Javidnia, Miri, et al., 2004, 2
Javidnia, K.; Miri, R.; Kamalinejad, M.; Sarkarzadeh, H.; Jamalian, A., Chemical composition of the essential oils of Anthemis altissima L. grown in Iran, Flavour Fragr. J., 2004, 19, 3, 213-216, https://doi.org/10.1002/ffj.1277 . [all data]

Javidnia, Miri, et al., 2004, 3
Javidnia, K.; Miri, R.; Sadeghpour, H., Composition of the volatile oil of Achillea wilhelmsii C. Koch from Iran, DARU, 2004, 12, 2, 63-66, retrieved from http://www1.tums.ac.ir/daru/. [all data]

Karioti, Hadjipavlou-Litina, et al., 2004
Karioti, A.; Hadjipavlou-Litina, D.; Mensah, M.L.K.; Fleischer, T.C.; Skaltsa, H., Composition and antioxidant activity of the essential oils of Xylopia aethiopica (Dun) A. Rich. (Annonaceae) leaves, stem bark, root bark, and fresh and dried fruits, growing in Ghana, J. Agric. Food Chem., 2004, 52, 26, 8094-8098, https://doi.org/10.1021/jf040150j . [all data]

Mardarowicz, Wianowska, et al., 2004
Mardarowicz, M.; Wianowska, D.; Dawidowicz, A.L.; Sawicki, R., The influence of sample treatment on SPME extracts from conifers. I. Comparison of terpene composition in Engelmann Spruce (Picea engelmanii) using hydrodistillation, SPME and PLE, Annales Universitatis Mariae Curie-Sklodowska Lublin - Polonia, 2004, 59, 3, 25-42. [all data]

Raina, Kumar, et al., 2004
Raina, V.K.; Kumar, A.; Srivastava, S.K.; Syamsundar, K.V.; Kahol, A.P., Essential oil composition of 'kewda' (Pandanus odoratissimus) from India, Flavour Fragr. J., 2004, 19, 5, 434-436, https://doi.org/10.1002/ffj.1331 . [all data]

Vérité, Nacer, et al., 2004
Vérité, P.; Nacer, A.; Kabouche, Z.; Seguin, E., Composition of seeds and stems essential oils of Pituranthos scoparius (Coss. Dur.) Schinz, Flavour Fragr. J., 2004, 19, 6, 562-564, https://doi.org/10.1002/ffj.1353 . [all data]

bin Ahmad and bin Jantan, 2003
bin Ahmad, F.; bin Jantan, I., Chemical constituents of the essential oils of Goniothalamus uvariodes King, Flavour Fragr. J., 2003, 18, 2, 128-130, https://doi.org/10.1002/ffj.1142 . [all data]

Bader, Flamini, et al., 2003
Bader, A.; Flamini, G.; Cioni, P.L.; Morelli, I., Essential oil composition of Achillea santolina L. and Achillea biebersteinii Afan. collected in Jordan, Flavour Fragr. J., 2003, 18, 1, 36-38, https://doi.org/10.1002/ffj.1147 . [all data]

Bicchi, Rubiolo, et al., 2003
Bicchi, C.; Rubiolo, P.; Camargo, E.E.S.; Vilegas, W.; Gracioso, J.S.; Brito, A.R.M.S., Components of Turnera diffusa Willd. var. afrodisiaca (Ward) Urb. essential oil, Flavour Fragr. J., 2003, 18, 1, 59-61, https://doi.org/10.1002/ffj.1155 . [all data]

Högnadóttir and Rouseff, 2003
Högnadóttir, Á.; Rouseff, R.L., Identification of aroma active compounds in organce essence oil using gas chromatography-olfactometry and gas chromatography-mass spectrometry, J. Chromatogr. A, 2003, 998, 1-2, 201-211, https://doi.org/10.1016/S0021-9673(03)00524-7 . [all data]

Karioti, Skaltsa, et al., 2003
Karioti, A.; Skaltsa, H.; Demetzos, C.; Perdetzoglou, D.; Economakis, C.D.; Salem, A.B., Effect of nitrogen concentration of the nutrient solution on the volatile constituents of leaves of Salvia fruticosa Mill. in solution culture, J. Agric. Food Chem., 2003, 51, 22, 6505-6508, https://doi.org/10.1021/jf030308k . [all data]

Lalel, Singh, et al., 2003
Lalel, H.J.D.; Singh, Z.; Chye Tan, S., Glycosidically-bound aroma volatile compounds in the skin and pulp of 'Kensington Pride' mango fruit at different stages of maturity, Postharvest Biol. Technol., 2003, 29, 2, 205-218, https://doi.org/10.1016/S0925-5214(02)00250-8 . [all data]

Macchioni, Cioni, et al., 2003
Macchioni, F.; Cioni, P.L.; Flamini, G.; Morelli, I.; Maccioni, S.; Ansaldi, M., Chemical composition of essential oils from needles, branches and cones of Pinus pinea, P. halepensis, P. pinaster and P. nigra from central Italy, Flavour Fragr. J., 2003, 18, 2, 139-143, https://doi.org/10.1002/ffj.1178 . [all data]

Skaltsa, Demetzos, et al., 2003
Skaltsa, H.D.; Demetzos, C.; Lazari, D.; Sokovic, M., Essential oil analysis and antimicrobial activity of eight Stachys species from Greece, Phytochemistry, 2003, 64, 3, 743-752, https://doi.org/10.1016/S0031-9422(03)00386-8 . [all data]

Tsiri, Kretsi, et al., 2003
Tsiri, D.; Kretsi, O.; Chinou, I.B.; Spyropoulos, C.G., Composition of fruit volatiles and annual changes in the volatiles of leaves of Eucalyptus camaldulensis Dehn. growing in Greece, Flavour Fragr. J., 2003, 18, 3, 244-247, https://doi.org/10.1002/ffj.1220 . [all data]

Tzakou, Couladis, et al., 2003
Tzakou, O.; Couladis, M.; Slavkovska, V.; Mimica-Dukic, N.; Jancic, R., The essential oil composition of Salvia brachyodon Vandas, Flavour Fragr. J., 2003, 18, 1, 2-4, https://doi.org/10.1002/ffj.1132 . [all data]

Javidnia, Miri, et al., 2002
Javidnia, K.; Miri, R.; Kamalinejad, M.; Nasiri, A., Composition of the essential oil of Salvia mirzayanii Rech. f. Esfand from Iran, Flavour Fragr. J., 2002, 17, 6, 465-467, https://doi.org/10.1002/ffj.1128 . [all data]

Nath, Sarma, et al., 2002
Nath, S.C.; Sarma, K.K.; Vajezikova, I.; Leclercq, P.A., Comparison of volatile inflorescence oils and taxonomy of certain Cymbopogon taxa described as Cymbopogon flexuosus (Nees ex Steud.) Wats., Biochem. Syst. Ecol., 2002, 30, 2, 151-162, https://doi.org/10.1016/S0305-1978(01)00066-7 . [all data]

Pino, Marbot, et al., 2002
Pino, J.A.; Marbot, R.; Quert, R.; García, H., Study of essential oils of Eucalyptus resinifera Smith, E. tereticornis Smith and Corymbia maculata (Hook.) K.D. Hill L.A.S. Johnson, grown in Cuba, Flavour Fragr. J., 2002, 17, 1, 1-4, https://doi.org/10.1002/ffj.1026 . [all data]

Pino, Marbot, et al., 2002, 2
Pino, J.A.; Marbot, R.; Bello, A., Volatile compounds of Psidium salutare (H.B.K.) Berg. fruit, J. Agric. Food Chem., 2002, 50, 18, 5146-5148, https://doi.org/10.1021/jf0116303 . [all data]

Pintore, Usai, et al., 2002
Pintore, G.; Usai, M.; Bradesi, P.; Juliano, C.; Boatto, G.; Tomi, F.; Chessa, M.; Cerri, R.; Casanova, J., Chemical composition and antimicrobial activity of Rosmarinus officinalis L. oils from Sardinia and Corsica, Flavour Fragr. J., 2002, 17, 1, 15-19, https://doi.org/10.1002/ffj.1022 . [all data]

Couladis, Tsortanidou, et al., 2001
Couladis, M.; Tsortanidou, V.; Francisco-Ortega, J.; Santos-Guerra, A.; Harvala, C., Composition of the essential oils of Argyranthemum species growing in the Canary Islands, Flavour Fragr. J., 2001, 16, 2, 103-106, https://doi.org/10.1002/ffj.954 . [all data]

Giamakis, Kretsi, et al., 2001
Giamakis, A.; Kretsi, O.; Chinou, I.; Spyropoulos, C.G., Eucalyptus camaldulensis: volatiles from immature flowers and high production of 1,8-cineole and β-pinene by in vitro cultures, Phytochemistry, 2001, 58, 2, 351-355, https://doi.org/10.1016/S0031-9422(01)00193-5 . [all data]

Pino and Marbot, 2001
Pino, J.A.; Marbot, R., Volatile flavor constituents of acerola (Malpighia emarginata DC.) fruit, J. Agric. Food Chem., 2001, 49, 12, 5880-5882, https://doi.org/10.1021/jf010270g . [all data]

Rezzi, Cavaleiro, et al., 2001
Rezzi, S.; Cavaleiro, C.; Bighelli, A.; Salgueiro, L.; da Cunha, A.P.; Casanova, J., Intraspecific chemical variability of the leaf essential oil of Juniperus phoenicea subsp. turbinata from Corsica, Biochem. Syst. Ecol., 2001, 29, 2, 179-188, https://doi.org/10.1016/S0305-1978(00)00044-2 . [all data]

Skaltsa, Mavrommati, et al., 2001
Skaltsa, H.D.; Mavrommati, A.; Constantinidis, T., A chemotaxonomic investigation of volatile constituents in Stachys subsect. Swainsonianeae (Labiatae), Phytochemistry, 2001, 57, 2, 235-244, https://doi.org/10.1016/S0031-9422(01)00003-6 . [all data]

Milos and Radonic, 2000
Milos, M.; Radonic, A., Gas chromatography mass spectral analysis of free and glycosidically bound volatile compounds from Juniperus oxycedrus L. growing wild in Croatia, Food Chem., 2000, 68, 3, 333-338, https://doi.org/10.1016/S0308-8146(99)00192-2 . [all data]

Skaltsa, Lazari, et al., 2000
Skaltsa, H.D.; Lazari, D.M.; Loukis, A.E.; Constantinidis, T., Essential oil analysis of Nepeta argolica Bory Chaub. subsp. argolica (Lamiaceae) growing wild in Greece, Flavour Fragr. J., 2000, 15, 2, 96-99, https://doi.org/10.1002/(SICI)1099-1026(200003/04)15:2<96::AID-FFJ873>3.0.CO;2-F . [all data]

Song, Sawamura, et al., 2000
Song, H.S.; Sawamura, M.; Ito, T.; Kawashimo, K.; Ukeda, H., Quantitative determination of characteric flavour of Citrus junos (yuzu) peel oil, Flavour Fragr. J., 2000, 15, 4, 245-250, https://doi.org/10.1002/1099-1026(200007/08)15:4<245::AID-FFJ904>3.0.CO;2-V . [all data]

Verzera, Trozzi, et al., 2000
Verzera, A.; Trozzi, A.; Cotroneo, A.; Lorenzo, D.; Dellacassa, E., Uruguayan essential oil. 12. Composition of Nova and Satsuma mandarin oils, J. Agric. Food Chem., 2000, 48, 7, 2903-2909, https://doi.org/10.1021/jf990734z . [all data]

Mazzoni, Tomi, et al., 1999
Mazzoni, V.; Tomi, F.; Casanova, J., A daucane-type sesquiterpene from Faucus carota seed oil, Flavour Fragr. J., 1999, 14, 5, 268-272, https://doi.org/10.1002/(SICI)1099-1026(199909/10)14:5<268::AID-FFJ823>3.0.CO;2-Z . [all data]

Muselli, Hoi, et al., 1999
Muselli, A.; Hoi, T.M.; Cu, L.D.; Moi, L.D.; Bessière, J.-M.; Bighelli, A.; Casanova, J., Composition of the essential oil of Acanthopanax trifoliatus (L.) Merr. (Araliacaea) from Vietnam, Flavour Fragr. J., 1999, 14, 1, 41-44, https://doi.org/10.1002/(SICI)1099-1026(199901/02)14:1<41::AID-FFJ781>3.0.CO;2-B . [all data]

Sumathykutty, Rao, et al., 1999
Sumathykutty, M.A.; Rao, J.M.; Padmakumari, K.P.; Narayanan, C.S., Essential oil constituents of some Piper species, Flavour Fragr. J., 1999, 14, 5, 279-282, https://doi.org/10.1002/(SICI)1099-1026(199909/10)14:5<279::AID-FFJ821>3.0.CO;2-0 . [all data]

Weyerstahl, Marschall, et al., 1999
Weyerstahl, P.; Marschall, H.; Wahlburg, H.-C.; Christiansen, C.; Rustaiyan, A.; Mirdjalili, F., Constituents of the essential oil of Pulicaria gnaphalodes (Vent.) Boiss. from Iran, Flavour Fragr. J., 1999, 14, 2, 121-130, https://doi.org/10.1002/(SICI)1099-1026(199903/04)14:2<121::AID-FFJ790>3.0.CO;2-K . [all data]

Bicchi, Rubiolo, et al., 1998
Bicchi, C.; Rubiolo, P.; Marschall, H.; Weyerstahl, P.; Laurent, R., Constituents of Artemisia roxburghiana Besser essential oil, Flavour Fragr. J., 1998, 13, 1, 40-46, https://doi.org/10.1002/(SICI)1099-1026(199801/02)13:1<40::AID-FFJ688>3.0.CO;2-Z . [all data]

Mariotti, Tomi, et al., 1997
Mariotti, J.P.; Tomi, F.; Casanova, J.; Costa, J.; Bernardini, A.F., Composition of the essential oil of Cistus Iadaniferus L. cultivated in corsica (France), Flavour Fragr. J., 1997, 12, 3, 147-151, https://doi.org/10.1002/(SICI)1099-1026(199705)12:3<147::AID-FFJ631>3.0.CO;2-Q . [all data]

Yang, Sugisawa, et al., 1992
Yang, R.; Sugisawa, H.; Nakatani, H.; Tamura, H.; Takagi, N., Comparison of odor quality in peel oils of acid citrus, Nippon Shokuhin Kogyo Gakkaishi, 1992, 39, 1, 16-24, https://doi.org/10.3136/nskkk1962.39.16 . [all data]

Tang, Zhang, et al., 1990
Tang, J.; Zhang, Y.; Hartman, T.G.; Rosen, R.T.; Ho, C.-T., Free and glycosidically bound volatile compounds in fresh celery (Apium graveolens L.), J. Agric. Food Chem., 1990, 38, 10, 1937-1940, https://doi.org/10.1021/jf00100a013 . [all data]