2-Cyclohexen-1-ol, 2-methyl-5-(1-methylethenyl)-, cis-

Van Den Dool and Kratz RI, non-polar column, custom temperature program

Data compiled by: NIST Mass Spectrometry Data Center, William E. Wallace, director

Column type CapillaryCapillaryCapillaryCapillaryCapillary
Active phase BPX-5BPX-5DB-5DB-5SE-52
Column length (m) 30.30.30.30.60.
Carrier gas He H2H2He
Substrate
Column diameter (mm) 0.250.250.250.250.32
Phase thickness (μm) 0.250.250.250.250.40
Program 35C => 4C/min => 200C => 30C/min => 300C (3min)35C(5min) => 3C/min => 210C => 40C/min => 240C (4min)40C(5min) => 2C/min => 220C => 5C/min => 250C(15min)40C(5min) => 2C/min => 220C => 5C/min => 250C(15min)45 C (6 min) 3 C/min -> 111 0C 2 C/min -> 160 C 3 C/min -> 300 C (15 min)
I 1241.1261.1226.1229.1232.
ReferenceDharmawan, Kasapis, et al., 2007Cardeal, da Silva, et al., 2006Boulanger, Chassagne, et al., 1999Boulanger, Chassagne, et al., 1999Mondello, Dugo, et al., 1995
Comment MSDC-RI MSDC-RI MSDC-RI MSDC-RI MSDC-RI

Kovats' RI, non-polar column, custom temperature program

Data compiled by: NIST Mass Spectrometry Data Center, William E. Wallace, director

Column type CapillaryCapillary
Active phase BP-1DB-5
Column length (m) 25.30.
Carrier gas N2
Substrate
Column diameter (mm) 0.250.25
Phase thickness (μm) 0.250.25
Program 60C => 5C/min => 220C(5min) => 3C/min => 245C(5min)50C(5min) => 2C/min => 250C (60min) => 2C/min => 270C => 1C/min => 290C
I 1208.1188.
ReferenceDwivedi, Khan, et al., 2004Roscigno, 1998
Comment MSDC-RI MSDC-RI

References

Dharmawan, Kasapis, et al., 2007
Dharmawan, J.; Kasapis, S.; Curran, P.; Johnson, J.R., Characterization of volatile compounds in selected citrus fruits from Asia. Part I: freshly-squeezed juice, Flavour Fragr. J., 2007, 22, 3, 228-232, https://doi.org/10.1002/ffj.1790 . [all data]

Cardeal, da Silva, et al., 2006
Cardeal, Z.L.; da Silva, M.D.R.G.; Marriott, P.J., Comprehensive two-dimensional gas chromatography/mass spectrometric analysis of pepper volatiles, Rapid Commun. Mass Spectrom., 2006, 20, 19, 2823-2836, https://doi.org/10.1002/rcm.2665 . [all data]

Boulanger, Chassagne, et al., 1999
Boulanger, R.; Chassagne, D.; Crouzet, J., Free and bound flavour components of amazonian fruits. 1: Bacuri, Flavour Fragr. J., 1999, 14, 5, 303-311, https://doi.org/10.1002/(SICI)1099-1026(199909/10)14:5<303::AID-FFJ834>3.0.CO;2-C . [all data]

Mondello, Dugo, et al., 1995
Mondello, L.; Dugo, P.; Basile, A.; Dugo, G., Interactive use of linear retention indices, on polar and apolar columns, with a MS-library for reliable identification of complex mixtures, J. Microcolumn Sep., 1995, 7, 6, 581-591, https://doi.org/10.1002/mcs.1220070605 . [all data]