Bicyclo[3.1.1]hept-3-en-2-one, 4,6,6-trimethyl-, (1S)-

Van Den Dool and Kratz RI, non-polar column, temperature ramp

View large format table.

Column type Active phase I Reference Comment
CapillaryHP-51204.Quijano, Salamanca, et al., 200730. m/0.25 mm/0.25 μm, He, 50. C @ 4. min, 4. K/min, 250. C @ 10. min
CapillaryHP-11191.Tang, Zhang, et al., 199050. m/0.32 mm/1.05 μm, He, 2. K/min, 230. C @ 40. min; Tstart: 40. C

Normal alkane RI, polar column, custom temperature program

View large format table.

Column type Active phase I Reference Comment
CapillaryHP Innowax1723.Noorizadeh and Farmany, 201060. m/0.25 mm/0.33 μm; Program: not specified

References

Quijano, Salamanca, et al., 2007
Quijano, C.E.; Salamanca, G.; Pino, J.A., Aroma volatile constituents of Colombian varieties of mango (Mangifera indica L.), Flavour Fragr. J., 2007, 22, 5, 401-406, https://doi.org/10.1002/ffj.1812 . [all data]

Tang, Zhang, et al., 1990
Tang, J.; Zhang, Y.; Hartman, T.G.; Rosen, R.T.; Ho, C.-T., Free and glycosidically bound volatile compounds in fresh celery (Apium graveolens L.), J. Agric. Food Chem., 1990, 38, 10, 1937-1940, https://doi.org/10.1021/jf00100a013 . [all data]

Noorizadeh and Farmany, 2010
Noorizadeh, H.; Farmany, A., Exploration of linear and nonlinear modeling techniques to predict of retention index of essential oils, J. Chin. Chem. Soc., 2010, 1268-1277. [all data]